Peptide,PTM,ModifiedAA,ModifiedPosition,PeptideUniqueToGene,ExperimentDesc,ExpID,PubmedID,ScoreType,IdentScore,LocProb,Log2FChange,PQ-val,QuantSig,PEP,MassErrorPPM
MDENNAAKLTGIR,nta,M,1,true,"Arabidopsis translation initiation landscape - NTA",167a,35069635,,,,,,,,
SEVPPLAAGK,ph,S,34,true,"Tissue atlas Arabidopsis - ProteomicsDB",114,32188942,"MaxQuant score",94.2590000,1.0000000,,,,8.5382197312356E-7,
QAVAMISPAINKR,ph,S,50,true,"Tissue atlas Arabidopsis - ProteomicsDB",114,32188942,"MaxQuant score",141.8700000,1.0000000,,,,3.199399998266E-6,
NGDSDEETCQSPEPPHDVPK,ph,S,65,true,"Tissue atlas Arabidopsis - ProteomicsDB",114,32188942,"MaxQuant score",192.2400000,1.0000000,,,,0,
NGDSDEETCQSPEPPHDVPK,ph,S,72,true,"Tissue atlas Arabidopsis - ProteomicsDB",114,32188942,"MaxQuant score",190.3300000,0.9999260,,,,0,
DLHPDDNSDGEAVAAKEE,ph,S,155,true,"Pollen phosphoproteome Arabidopsis",43,22631563,"MASCOT Score",62.0900000,,,,,,
DLHPDDNSDGEAVAAKEE,ph,S,155,true,"Phospho cell culture sucrose/TOR",109,30833711,,,1.0000000,,,,,
DLHPDDNSDGEAVAAKEE,ph,S,155,true,"Tissue atlas Arabidopsis - ProteomicsDB",114,32188942,"MaxQuant score",235.2500000,1.0000000,,,,0,
DLHPDDNSDGEAVAAK,ph,S,155,true,"TOR Kinase and ABA Receptor",100,29290610,XCorr,4.3304596,1.0000000,,,,1.4539999938279E-5,
