Peptide,PTM,ModifiedAA,ModifiedPosition,PeptideUniqueToGene,ExperimentDesc,ExpID,PubmedID,ScoreType,IdentScore,LocProb,Log2FChange,PQ-val,QuantSig,PEP,MassErrorPPM
APSSNGVSPNPVEGER,ph,S,10,true,"Tissue atlas Arabidopsis - ProteomicsDB",114,32188942,"MaxQuant score",49.2980000,0.9485870,,,,0.0048893298953772,
TQPLQSHSHPQPQQLQQHK,ph,S,593,true,"Tissue atlas Arabidopsis - ProteomicsDB",114,32188942,"MaxQuant score",109.3200000,0.9843390,,,,2.0353499441406E-10,
QLQQAHHHLGASTSQSSVIETSK,og,S,680,true,"O-GlcNac Inflorescence Tissue",81,28154133,"MASCOT Score",24.6000000,,,,,,1.1000000
QLQQAHHHLGASTSQSSVIETSK,og,S,690,true,"O-GlcNac Inflorescence Tissue",81,28154133,"MASCOT Score",58.8000000,,,,,,0.4100000
ASLTDHQLEASASGTSYGLDGGENNR,ph,S,922,true,"Tissue atlas Arabidopsis - ProteomicsDB",114,32188942,"MaxQuant score",64.0450000,0.8018930,,,,1.0129399470316E-6,
GYDSQKDLQNMLSNYGGVTNDIGTEMSTSAVR,ph,S,973,true,"Tissue atlas Arabidopsis - ProteomicsDB",114,32188942,"MaxQuant score",86.7690000,0.8637610,,,,1.118570038012E-17,
TYTKVQKR,ub,K,1045,false,"Arabidopsis ubiquitination COFRADIC",40,26744219,"MaxQuant Score",51.3460000,0.9810000,,,,0.024000000208616,0.4760000
YRGYDELR,ph,Y,1058,true,"Conserved plant phosphoproteome - Arabidopsis",61a,20466843,"MASCOT Score",35.0000000,1.0000000,,,,,
GHYDDNSATSFNR,ph,S,1159,true,"Tissue atlas Arabidopsis - ProteomicsDB",114,32188942,"MaxQuant score",172.4300000,0.9996460,,,,2.1920100944198E-15,
GHYDDNSATSFNR,ph,S,1162,true,"Tissue atlas Arabidopsis - ProteomicsDB",114,32188942,"MaxQuant score",219.8900000,0.9931990,,,,0,
