Peptide,PTM,ModifiedAA,ModifiedPosition,PeptideUniqueToGene,ExperimentDesc,ExpID,PubmedID,ScoreType,IdentScore,LocProb,Log2FChange,PQ-val,QuantSig,PEP,MassErrorPPM
AASVVAPKYTSIKPLGDRVL,nt,A,51,true,"Arabidopsis translation initiation landscape - NT",167b,35069635,,,,,,,,
AASVVAPKYTSIKPLGDR,nt,A,51,true,"Stromal N-terminome",96,26371235,"MASCOT Score",50.1700000,,,,,,
AASVVAPKYTSIKPLGDR,nta,A,51,true,"Stromal N-terminome",96,26371235,"MASCOT Score",30.1300000,,,,,,
ASVVAPKYTSIKPLGDRVLVKIKE,nt,A,52,true,"Arabidopsis translation initiation landscape - NT",167b,35069635,,,,,,,,
ASVVAPKYTSIKPLGDR,nt,A,52,true,"Arg/N-end rule pathway Roots",80,25728785,"MASCOT Score",83.0400000,,,,,1.9770000747599E-8,
ASVVAPKYTSIKPLGDR,nt,A,52,true,"N-terminal ChaFRADIC",92,26010716,"MASCOT Score",45.5900000,,,,,4.9170001403809E-11,
ASVVAPKYTSIKPLGDR,nt,A,52,true,"Stromal N-terminome",96,26371235,"MASCOT Score",79.6000000,,,,,,
ASVVAPKYTSIKPLGDR,nt,A,52,true,"FtsH12 N-terminome: WT / FtsH12 knockdown miRNA",118,33216923,"MaxQuant score",122.0100000,,0.5311890,0.0317482,NO,1.6300000170615E-24,
ASVVAPKYTSIKPLGDR,nt,A,52,true,"HUNTER N-terminome: legumain, GluC and trypsin",119,31951383,"MaxQuant score",136.2000000,,,,,,
ASVVAPKYTSIKPLGD,nt,A,52,true,"HUNTER N-terminome: legumain, GluC and trypsin",119,31951383,"MaxQuant score",95.7670000,,,,,,
ASVVAPK,nt,A,52,true,"N-terminal ChaFRADIC",92,26010716,"MASCOT Score",36.9000000,,,,,0.06453999876976,
ASVVAPKYTSIKPLGDR,nta,A,52,true,"Stromal N-terminome",96,26371235,"MASCOT Score",35.7200000,,,,,,
SVVAPKYTSIKPLGDRVL,nt,S,53,true,"Arabidopsis translation initiation landscape - NT",167b,35069635,,,,,,,,
SVVAPKYTSIKPLGDR,nt,S,53,true,"HUNTER N-terminome: legumain, GluC and trypsin",119,31951383,"MaxQuant score",77.1910000,,,,,,
YTSIKPLGDR,ph,S,61,true,"Tissue atlas Arabidopsis - ProteomicsDB",114,32188942,"MaxQuant score",92.7070000,0.9994630,,,,0.00034906101063825,
EAEEKTLGGILLPSTAQSK,ac,K,79,true,"Histone deacetylases substrates - hda14 vs WT",98e,29061669,"MaxQuant Score",85.1000000,1.0000000,-0.7610000,0.6382635,NO,4.6999999378516E-12,
EAEEKTLGGILLPSTAQSKPQGGEVVAVGEGR,ph,T,80,true,"Large-scale phosphorylation discovery",44,23111157,XCorr,4.1860000,,,,,,
EAEEKTLGGILLPSTAQSKPQGGEVVAVGEGR,ph,T,80,true,"Tissue atlas Arabidopsis - ProteomicsDB",114,32188942,"MaxQuant score",52.3410000,0.9992260,,,,2.5480399926892E-5,
GILLPSTAQSKPQGGEVVAVGEGR,nt,G,83,true,"Arabidopsis translation initiation landscape - NT",167b,35069635,,,,,,,,
TLGGILLPSTAQSKPQGGEVVAVGEGR,ph,S,88,true,"Tissue atlas Arabidopsis - ProteomicsDB",114,32188942,"MaxQuant score",118.7400000,0.8174750,,,,1.0939099919229E-34,
TLGGILLPSTAQSKPQGGEVVAVGEGR,ph,S,92,true,"Tissue atlas Arabidopsis - ProteomicsDB",114,32188942,"MaxQuant score",131.0800000,0.9766440,,,,1.1686829192469E-42,
TLGGILLPSTAQSKPQGGEVVAVGEGRTIGK,ph,T,107,true,"Tissue atlas Arabidopsis - ProteomicsDB",114,32188942,"MaxQuant score",47.0990000,0.9463490,,,,0.00020731499535032,
YAGTEVEFNDVK,ph,Y,128,true,"Tyrosine phosphorylation in Arabidopsis",59,18463617,"MASCOT Score",92.0000000,,,,,,-0.8961807
YAGTEVEFNDVK,ph,Y,128,true,"Conserved plant phosphoproteome - Arabidopsis",61a,20466843,"MASCOT Score",92.0000000,1.0000000,,,,,
YAGTEVEFNDVK,ph,Y,128,true,"srk2dei ABA signaling phopshoproteomics",83,23572148,"MASCOT Score",60.0000000,,,,,,0.0010000
YAGTEVEFNDVK,ph,Y,128,true,"atm and atr DNA damage response",88,25561503,"MASCOT Score",70.0000000,1.0000000,,,,,-0.3700000
YAGTEVEFNDVK,ph,Y,128,true,"Phospho cell culture sucrose/TOR",109,30833711,,,0.9999990,,,,,
YAGTEVEFNDVK,ph,Y,128,true,"Tissue atlas Arabidopsis - ProteomicsDB",114,32188942,"MaxQuant score",250.7600000,1.0000000,,,,0,
YAGTEVEFNDVK,ph,T,131,true,"srk2dei ABA signaling phopshoproteomics",83,23572148,"MASCOT Score",24.0000000,,,,,,0.0018000
YAGTEVEFNDVK,ph,T,131,true,"Tissue atlas Arabidopsis - ProteomicsDB",114,32188942,"MaxQuant score",126.0900000,1.0000000,,,,9.9587603472173E-5,
ILETEDIKDLKPLNDRVF,nt,I,151,true,"Arabidopsis translation initiation landscape - NT",167b,35069635,,,,,,,,
EDDIVGILETEDIKDLKPLNDR,cr,K,158,true,"Open search Plant PTM Viewer 2.0 - Crotonylation",164c,TBA,,,,,,,,
VFIKVAEAEEK,ac,K,170,true,"Histone deacetylases substrates - TSA vs control",98b,29061669,"MaxQuant Score",75.0000000,1.0000000,0.5110000,0.6251727,NO,0.00011999999696855,
VFIKVAEAEEK,cr,K,170,true,"Open search Plant PTM Viewer 2.0 - Crotonylation",164c,TBA,,,,,,,,
VAEAEEKTAGGLLLTETTK,ac,K,177,true,"Histone deacetylases substrates - hda14 vs WT",98e,29061669,"MaxQuant Score",66.6000000,1.0000000,-0.1810000,0.9705100,NO,1.900000029309E-6,
VAEAEEKTAGGLLLTETTK,ph,T,178,true,"Large-scale phosphorylation discovery",44,23111157,XCorr,4.1790000,,,,,,
VAEAEEKTAGGLLLTETTK,ph,T,178,true,"Tissue atlas Arabidopsis - ProteomicsDB",114,32188942,"MaxQuant score",199.3000000,1.0000000,,,,0,
TAGGLLLTETTK,ph,T,178,true,"srk2dei ABA signaling phopshoproteomics",83,23572148,"MASCOT Score",66.0000000,,,,,,0.0000000
TAGGLLLTETTK,ph,T,178,true,"TOR Kinase and ABA Receptor",100,29290610,XCorr,3.4954078,0.9970000,,,,8.6289997852873E-5,
ITPLPVSTGSTVLYSK,ph,S,217,true,"Tissue atlas Arabidopsis - ProteomicsDB",114,32188942,"MaxQuant score",162.5900000,0.8288130,,,,4.8729598779501E-14,
ITPLPVSTGSTVLYSKYAGNDFK,ac,K,226,true,"Histone deacetylases substrates - hda14 vs WT",98e,29061669,"MaxQuant Score",174.6000000,1.0000000,0.4400000,0.9162205,NO,0,
YAGNDFKGK,ac,K,233,true,"Quantitative Acetylproteomics",101,29440448,,,,,,,,
