Peptide,PTM,ModifiedAA,ModifiedPosition,PeptideUniqueToGene,ExperimentDesc,ExpID,PubmedID,ScoreType,IdentScore,LocProb,Log2FChange,PQ-val,QuantSig,PEP,MassErrorPPM
VKRNRVPPAEQALPIEEDCKSL,nt,V,2,true,"Arabidopsis translation initiation landscape - NT",167b,35069635,,,,,,,,
FYELGSSPECHQGNR,so,C,274,true,"Arabidopsis S-sulfenylation chemoproteomics",108,31578252,"pFind PSM Score",0.0302973,,1.5909100,,,,-1.3836787
IASEMSPSKSEVASVCDVAEPVSVSK,ph,S,398,true,"Tissue atlas Arabidopsis - ProteomicsDB",114,32188942,"MaxQuant score",196.6800000,0.9426210,,,,0,
IASEMSPSK,ph,S,398,true,"Phospho cell culture sucrose/TOR",109,30833711,,,0.9853970,,,,,
IASEMSPSK,ph,S,400,true,"TOR Kinase and ABA Receptor",100,29290610,XCorr,3.0136547,0.9859000,,,,0.021849999204278,
SEVASVCDVAEPVSVSK,ph,S,415,true,"Tissue atlas Arabidopsis - ProteomicsDB",114,32188942,"MaxQuant score",169.4300000,0.8985900,,,,1.486999972637E-37,
ENKGEEQVSTVNR,ub,K,428,true,"Arabidopsis ubiquitination COFRADIC",40,26744219,"MaxQuant Score",73.9270000,1.0000000,,,,0.00015330000314862,0.0500000
DAAETSLAGPSSEK,ph,S,449,true,"Tissue atlas Arabidopsis - ProteomicsDB",114,32188942,"MaxQuant score",210.0800000,0.7935390,,,,1.6675451725465E-42,
DAAETSLAGPSSEKSSKR,ub,K,452,true,"Arabidopsis ubiquitination COFRADIC",40,26744219,"MaxQuant Score",60.7640000,0.9390000,,,,2.5509999668216E-10,-0.0770000
CPPSATPRGSALK,ph,T,485,true,"srk2dei ABA signaling phopshoproteomics",83,23572148,"MASCOT Score",23.0000000,,,,,,-0.0019000
