Peptide,PTM,ModifiedAA,ModifiedPosition,PeptideUniqueToGene,ExperimentDesc,ExpID,PubmedID,ScoreType,IdentScore,LocProb,Log2FChange,PQ-val,QuantSig,PEP,MassErrorPPM
SSPSLLLR,ph,S,26,true,"Lateral root-induction - NAA vs control",106,23328941,"MASCOT Score",23.0000000,,,,,,
SSPSLLLR,ph,S,27,true,"Tyrosine phosphorylation in Arabidopsis",59,18463617,"MASCOT Score",30.0000000,,,,,,-0.6305976
SSPSLLLR,ph,S,27,true,"srk2dei ABA signaling phopshoproteomics",83,23572148,"MASCOT Score",33.0000000,,,,,,-0.0002000
SSPSLLLR,ph,S,27,true,"SnRK2 protein kinase substrates",85,23776212,XCorr,2.2666278,0.8990000,,,,0.046053800731897,
SSPSLLLR,ph,S,27,true,"atm and atr DNA damage response",88,25561503,"MASCOT Score",37.0000000,0.9980000,,,,,0.1100000
SSPSLLLR,ph,S,27,true,"Tissue atlas Arabidopsis - ProteomicsDB",114,32188942,"MaxQuant score",129.3800000,0.9803750,,,,0.0029487800784409,
SSPSLLLR,ph,S,29,true,"LAXIC - mannitol vs control",84b,23660473,XCorr,2.3600000,0.9250000,,,,0.0027054799720645,
SWVKAVATR,ub,K,63,true,"upl3 mutant / wildtype",168,35926874,"MaxQuant score",57.5500000,1.0000000,0.8286316,0.2413800,NO,0.0063191200606525,-0.0166160
LENMCWR,acy,C,81,false,"Arabidopsis S-acylation atlas - Silique",163e,35681017,,,,,,,,
EATADMSEEFSEGEKGDIISDISTHGESTKPR,ph,T,117,true,"Arabidopsis root NAA phosphoproteome",18a,27643528,"MaxQuant Score",70.8110000,0.9720000,,,,7.7399997522321E-9,-0.0820000
EATADMSEEFSEGEKGDIISDISTHGESTKPR,ph,T,117,true,"Tissue atlas Arabidopsis - ProteomicsDB",114,32188942,"MaxQuant score",270.8100000,0.9999980,,,,0,
EATADMSEEFSEGEK,ph,T,117,true,"Tyrosine phosphorylation in Arabidopsis",59,18463617,"MASCOT Score",37.0000000,,,,,,-0.7409005
REATADMSEEFSEGEKGDIISDISTHGESTKPR,ph,S,121,true,"PAMP-triggered phosphorylation",48,24601666,"MASCOT Score",31.7300000,,,,,,
EATADMSEEFSEGEKGDIISDISTHGESTKPR,ph,S,121,true,"Arabidopsis root NAA phosphoproteome",18a,27643528,"MaxQuant Score",70.8110000,0.9840000,,,,7.7399997522321E-9,-0.6940000
EATADMSEEFSEGEKGDIISDISTHGESTKPR,ph,S,121,true,"PAMP-triggered phosphorylation",48,24601666,"MASCOT Score",94.5700000,,,,,,
EATADMSEEFSEGEKGDIISDISTHGESTKPR,ph,S,121,true,"srk2dei ABA signaling phopshoproteomics",83,23572148,"MASCOT Score",29.0000000,,,,,,-0.0018000
REATADMSEEFSEGEK,ph,S,121,true,"atm and atr DNA damage response",88,25561503,"MASCOT Score",61.0000000,1.0000000,,,,,-0.4100000
EATADMSEEFSEGEK,ph,S,121,true,"Tyrosine phosphorylation in Arabidopsis",59,18463617,"MASCOT Score",79.0000000,,,,,,-0.8052333
EATADMSEEFSEGEK,ph,S,121,true,"Chloroplast kinase substrates",60,19376835,"MASCOT Score",49.1300000,,,,,,-1.1609600
EATADMSEEFSEGEK,ph,S,121,true,"srk2dei ABA signaling phopshoproteomics",83,23572148,"MASCOT Score",95.0000000,,,,,,-0.0008000
EATADMSEEFSEGEK,ph,S,121,true,"atm and atr DNA damage response",88,25561503,"MASCOT Score",71.0000000,1.0000000,,,,,-0.5600000
EATADMSEEFSEGEK,ph,S,121,true,"TOR Kinase and ABA Receptor",100,29290610,XCorr,5.5279737,1.0000000,,,,1.5230000371957E-6,
EATADMSEEFSEGEK,ph,S,121,true,"Phospho cell culture sucrose/TOR",109,30833711,,,1.0000000,,,,,
EATADMSEEFSEGEK,ph,S,121,true,"Tissue atlas Arabidopsis - ProteomicsDB",114,32188942,"MaxQuant score",319.8200000,1.0000000,,,,0,
REATADMSEEFSEGEKGDIISDISTHGESTKPR,ph,S,125,true,"PAMP-triggered phosphorylation",48,24601666,"MASCOT Score",31.7300000,,,,,,
EATADMSEEFSEGEKGDIISDISTHGESTKPR,ph,S,125,true,"Arabidopsis root NAA phosphoproteome",18a,27643528,"MaxQuant Score",70.8110000,0.9810000,,,,7.7399997522321E-9,-0.6940000
EATADMSEEFSEGEKGDIISDISTHGESTKPR,ph,S,125,true,"PAMP-triggered phosphorylation",48,24601666,"MASCOT Score",94.5700000,,,,,,
EATADMSEEFSEGEKGDIISDISTHGESTKPR,ph,S,125,true,"srk2dei ABA signaling phopshoproteomics",83,23572148,"MASCOT Score",29.0000000,,,,,,-0.0018000
REATADMSEEFSEGEK,ph,S,125,true,"atm and atr DNA damage response",88,25561503,"MASCOT Score",40.0000000,1.0000000,,,,,-0.6200000
EATADMSEEFSEGEK,ph,S,125,true,"Tyrosine phosphorylation in Arabidopsis",59,18463617,"MASCOT Score",68.0000000,,,,,,-0.9777835
EATADMSEEFSEGEK,ph,S,125,true,"Chloroplast kinase substrates",60,19376835,"MASCOT Score",64.5800000,,,,,,-0.8763230
EATADMSEEFSEGEK,ph,S,125,true,"srk2dei ABA signaling phopshoproteomics",83,23572148,"MASCOT Score",75.0000000,,,,,,0.0006000
EATADMSEEFSEGEK,ph,S,125,true,"atm and atr DNA damage response",88,25561503,"MASCOT Score",71.0000000,1.0000000,,,,,-0.5600000
EATADMSEEFSEGEK,ph,S,125,true,"TOR Kinase and ABA Receptor",100,29290610,XCorr,5.5279737,1.0000000,,,,1.5230000371957E-6,
EATADMSEEFSEGEK,ph,S,125,true,"Phospho cell culture sucrose/TOR",109,30833711,,,0.9999990,,,,,
EATADMSEEFSEGEK,ph,S,125,true,"Tissue atlas Arabidopsis - ProteomicsDB",114,32188942,"MaxQuant score",270.8100000,1.0000000,,,,0,
EATADMSEEFSEGEKGDIISDISTHGESTKPR,ph,S,134,true,"PAMP-triggered phosphorylation",48,24601666,"MASCOT Score",53.3700000,,,,,,
GDIISDISTHGESTKPR,ph,S,134,true,"srk2dei ABA signaling phopshoproteomics",83,23572148,"MASCOT Score",26.0000000,,,,,,0.0004000
GDIISDISTHGESTKPR,ph,S,134,true,"Tissue atlas Arabidopsis - ProteomicsDB",114,32188942,"MaxQuant score",59.6140000,0.9975530,,,,0.00021496099361684,
EATADMSEEFSEGEKGDIISDISTHGESTKPR,ph,S,137,true,"PAMP-triggered phosphorylation",48,24601666,"MASCOT Score",53.3700000,,,,,,
GDIISDISTHGESTKPR,ph,S,137,true,"srk2dei ABA signaling phopshoproteomics",83,23572148,"MASCOT Score",26.0000000,,,,,,0.0004000
GDIISDISTHGESTKPR,ph,S,137,true,"atm and atr DNA damage response",88,25561503,"MASCOT Score",55.0000000,0.9470000,,,,,0.2900000
GDIISDISTHGESTKPR,ph,S,137,true,"Tissue atlas Arabidopsis - ProteomicsDB",114,32188942,"MaxQuant score",84.9460000,0.8238350,,,,4.4594700739253E-5,
GDIISDISTHGESTKPR,ph,T,143,true,"srk2dei ABA signaling phopshoproteomics",83,23572148,"MASCOT Score",35.0000000,,,,,,0.0006000
GDIISDISTHGESTKPR,ph,T,143,true,"TOR Kinase and ABA Receptor",100,29290610,XCorr,4.3742766,0.8622000,,,,0.0001336999994237,
GDIISDISTHGESTKPR,ph,T,143,true,"Tissue atlas Arabidopsis - ProteomicsDB",114,32188942,"MaxQuant score",100.5300000,0.8443020,,,,9.1629499365808E-7,
INSAESMELWASQQK,ph,S,152,true,"Arabidopsis root NAA phosphoproteome",18a,27643528,"MaxQuant Score",141.1800000,1.0000000,,,,1.7179999519425E-18,-0.7230000
INSAESMELWASQQK,ph,S,152,true,"Phosphorylation nuclei-enriched fractions",28,19245862,,,,,,,,
INSAESMELWASQQK,ph,S,152,true,"Mitochondrial phosphoproteome",32,19688752,"MASCOT Score",49.1000000,,,,,,5.9565100
INSAESMELWASQQK,ph,S,152,true,"Phytohormone-responsive phosphoproteins",34,20374526,"MASCOT Score",84.0000000,,,,,,-5.5921000
INSAESMELWASQQK,ph,S,152,true,"PAMP-triggered phosphorylation",48,24601666,"MASCOT Score",68.4800000,,,,,,
INSAESMELWASQQK,ph,S,152,true,"Tyrosine phosphorylation in Arabidopsis",59,18463617,"MASCOT Score",98.0000000,,,,,,-0.6605132
INSAESMELWASQQK,ph,S,152,true,"Chloroplast kinase substrates",60,19376835,"MASCOT Score",105.5300000,,,,,,-2.3677300
INSAESMELWASQQK,ph,S,152,true,"BSK8 and BSL2 regulating sucrose-ph synthase",66,24924143,"MaxQuant Score",238.8000000,,,,,,0.0155270
INSAESMELWASQQK,ph,S,152,true,"srk2dei ABA signaling phopshoproteomics",83,23572148,"MASCOT Score",99.0000000,,,,,,0.0011000
INSAESMELWASQQK,ph,S,152,true,"LAXIC - ABA stress",84a,23660473,XCorr,5.1500000,1.0000000,,,,3.8099998711516E-9,
INSAESMELWASQQK,ph,S,152,true,"LAXIC - mannitol vs control",84b,23660473,XCorr,5.8800000,1.0000000,-1.7439853,,NO,4.3000000791257E-16,
INSAESMELWASQQK,ph,S,152,true,"SnRK2 protein kinase substrates",85,23776212,XCorr,6.1168952,1.0000000,,,,0.00020086400036234,
INSAESMELWASQQK,ph,S,152,true,"SIRK1 phosphorylation",86a,23820729,"MaxQuant Score",204.2700000,1.0000000,,,,2.3599999732227E-10,7.2290000
INSAESMELWASQQK,ph,S,152,true,"SIRK1 exp - sirk1 mutant vs WT",86b,23820729,,,,1.3016745,,NO,,
INSAESMELWASQQK,ph,S,152,true,"SIRK1 exp - 35S:SIRK1 vs WT",86c,23820729,,,,1.4003246,,NO,,
INSAESMELWASQQK,ph,S,152,true,"atm and atr DNA damage response",88,25561503,"MASCOT Score",101.0000000,1.0000000,,,,,-0.9300000
INSAESMELWASQQK,ph,S,152,true,"TOR Kinase and ABA Receptor",100,29290610,XCorr,5.8521733,1.0000000,,,,4.7800000402276E-8,
INSAESMELWASQQK,ph,S,152,true,"Lateral root-induction - NAA vs control",106,23328941,"MASCOT Score",64.0000000,,0.0406018,0.9352058,NO,,
INSAESMELWASQQK,ph,S,152,true,"Phosphorylation tonoplast membrane fraction",107,18686298,"MASCOT Score",65.0000000,,,,,,
INSAESMELWASQQK,ph,S,152,true,"Phospho cell culture sucrose/TOR",109,30833711,,,1.0000000,,,,,
INSAESMELWASQQK,ph,S,152,true,"Col-0 callus - FC Col-0 vs. Col-0 Xray",111a,31410901,,104.1500000,,0.9437773,0.0000000,NO,,1.6307201
INSAESMELWASQQK,ph,S,152,true,"Col-0 X-ray callus - FC Col-0 vs. Col-0 Xray",111b,31410901,,104.1500000,,0.9437773,0.0000000,NO,,1.6307201
INSAESMELWASQQK,ph,S,152,true,"atm callus - FC atm vs. atm Xray",111c,31410901,,104.1500000,,1.1675725,0.0000000,NO,,1.6307201
INSAESMELWASQQK,ph,S,152,true,"atm-3 X-ray callus - FC atm vs. atm Xray",111d,31410901,,104.1500000,,1.1675725,0.0000000,NO,,1.6307201
INSAESMELWASQQK,ph,S,152,true,"Tissue atlas Arabidopsis - ProteomicsDB",114,32188942,"MaxQuant score",399.8500000,1.0000000,,,,0,
INSAESMELWASQQK,ph,S,155,true,"PAMP-triggered phosphorylation",48,24601666,"MASCOT Score",60.8600000,,,,,,
INSAESMELWASQQK,ph,S,155,true,"Tyrosine phosphorylation in Arabidopsis",59,18463617,"MASCOT Score",58.0000000,,,,,,-0.5504277
INSAESMELWASQQK,ph,S,155,true,"Chloroplast kinase substrates",60,19376835,"MASCOT Score",35.7600000,,,,,,0.9341880
INSAESMELWASQQK,ph,S,155,true,"srk2dei ABA signaling phopshoproteomics",83,23572148,"MASCOT Score",69.0000000,,,,,,0.0003000
INSAESMELWASQQK,ph,S,155,true,"LAXIC - mannitol vs control",84b,23660473,XCorr,5.3900000,1.0000000,,,,9.5899997631932E-7,
INSAESMELWASQQK,ph,S,155,true,"SnRK2 protein kinase substrates",85,23776212,XCorr,5.1694036,1.0000000,,,,2.2285999434768E-11,
INSAESMELWASQQK,ph,S,155,true,"atm and atr DNA damage response",88,25561503,"MASCOT Score",49.0000000,1.0000000,,,,,-0.8000000
INSAESMELWASQQK,ph,S,155,true,"TOR Kinase and ABA Receptor",100,29290610,XCorr,5.8521733,1.0000000,,,,4.7800000402276E-8,
INSAESMELWASQQK,ph,S,155,true,"Lateral root-induction - NAA vs control",106,23328941,"MASCOT Score",51.0000000,,0.1282006,0.6568875,NO,,
INSAESMELWASQQK,ph,S,155,true,"Tissue atlas Arabidopsis - ProteomicsDB",114,32188942,"MaxQuant score",276.8900000,1.0000000,,,,0,
QVSSPDVDYSYGEPTEMLTPR,nt,Q,221,true,"HUNTER N-terminome: legumain, GluC and trypsin",119,31951383,"MaxQuant score",89.5410000,,,,,,
DSEDFSDEMGESSGAYIVR,ph,S,247,true,"PAMP-triggered phosphorylation",48,24601666,"MASCOT Score",56.9300000,,,,,,
DSEDFSDEMGESSGAYIVR,ph,S,247,true,"Tyrosine phosphorylation in Arabidopsis",59,18463617,"MASCOT Score",87.0000000,,,,,,-0.5522781
DSEDFSDEMGESSGAYIVR,ph,S,247,true,"srk2dei ABA signaling phopshoproteomics",83,23572148,"MASCOT Score",92.0000000,,,,,,0.0002000
DSEDFSDEMGESSGAYIVR,ph,S,247,true,"SnRK2 protein kinase substrates",85,23776212,XCorr,4.9488082,1.0000000,,,,2.9837599540639E-15,
DSEDFSDEMGESSGAYIVR,ph,S,247,true,"atm and atr DNA damage response",88,25561503,"MASCOT Score",41.0000000,1.0000000,,,,,-0.0900000
DSEDFSDEMGESSGAYIVR,ph,S,247,true,"Phospho cell culture sucrose/TOR",109,30833711,,,0.9999260,,,,,
DSEDFSDEMGESSGAYIVR,ph,S,247,true,"Tissue atlas Arabidopsis - ProteomicsDB",114,32188942,"MaxQuant score",202.3400000,1.0000000,,,,0,
SGAYIVR,nt,S,254,false,"Arabidopsis translation initiation landscape - NT",167b,35069635,,,,,,,,
LSKEEINSTYK,pgk,K,357,true,"Open search Plant PTM Viewer 2.0 - 3pgK",164f,TBA,,,,,,,,
QEIDEQWR,nt,Q,389,true,"HUNTER N-terminome: legumain, GluC and trypsin",119,31951383,"MaxQuant score",83.2650000,,,,,,
AFGECR,so,C,501,false,"Arabidopsis S-sulfenylation chemoproteomics",108,31578252,"pFind PSM Score",0.2307040,,0.9901000,,,,0.4708756
LVADKHLWAK,ac,K,635,true,"Quantitative Acetylproteomics",101,29440448,,,,,,,,
QNGLKNIHQFSWPEHCKTYLSR,nt,Q,643,true,"HUNTER N-terminome: legumain, GluC and trypsin",119,31951383,"MaxQuant score",,,,,,,
NIHQFSWPEHCK,sno,C,658,true,"Site-specific nitrosomeproteomic id - gsnor1-3",90a,25699590,XCorr,2.2366555,,,,,0.00040140000055544,-6.6660581
ITSFKPR,ph,S,667,true,"TOR Kinase and ABA Receptor",100,29290610,XCorr,2.3004458,0.9942000,,,,0.024520000442863,
HPQWQSDDGGDNSEPESPSDSLR,ph,S,677,true,"srk2dei ABA signaling phopshoproteomics",83,23572148,"MASCOT Score",32.0000000,,,,,,-0.0013000
HPQWQSDDGGDNSEPESPSDSLR,ph,S,677,true,"atm and atr DNA damage response",88,25561503,"MASCOT Score",41.0000000,1.0000000,,,,,1.0600000
HPQWQSDDGGDNSEPESPSDSLR,ph,S,677,true,"Lateral root-induction - NAA vs control",106,23328941,"MASCOT Score",20.0000000,,,,,,
HPQWQSDDGGDNSEPESPSDSLRDIQDISLNLK,ph,S,684,true,"Brassinosteroid-Regulated Phosphorylation Dynamics",94,26187819,"MaxQuant Score",66.3650000,0.9640000,,,,0.0010000000474975,-2.4890000
HPQWQSDDGGDNSEPESPSDSLRDIQDISLNLK,ph,S,684,true,"TOR Kinase and ABA Receptor",100,29290610,XCorr,4.1051898,0.9942000,,,,0.014200000092387,
HPQWQSDDGGDNSEPESPSDSLR,ph,S,684,true,"STN8 phosphoproteome",38,21768351,"MASCOT Score",52.0700000,,,,,,-1.3439600
HPQWQSDDGGDNSEPESPSDSLR,ph,S,684,true,"Large-scale phosphorylation discovery",44,23111157,XCorr,5.2520000,,,,,,
HPQWQSDDGGDNSEPESPSDSLR,ph,S,684,true,"PAMP-triggered phosphorylation",48,24601666,"MASCOT Score",41.7800000,,,,,,
HPQWQSDDGGDNSEPESPSDSLR,ph,S,684,true,"srk2dei ABA signaling phopshoproteomics",83,23572148,"MASCOT Score",61.0000000,,,,,,-0.0011000
HPQWQSDDGGDNSEPESPSDSLR,ph,S,684,true,"LAXIC - ABA stress",84a,23660473,XCorr,4.7900000,0.9920000,,,,0.0073232799768448,
HPQWQSDDGGDNSEPESPSDSLR,ph,S,684,true,"LAXIC - mannitol vs control",84b,23660473,XCorr,4.2200000,0.9970000,,,,7.0499998400919E-5,
HPQWQSDDGGDNSEPESPSDSLR,ph,S,684,true,"SnRK2 protein kinase substrates",85,23776212,XCorr,4.2273579,0.9980000,,,,1.3627999578603E-5,
HPQWQSDDGGDNSEPESPSDSLR,ph,S,684,true,"atm and atr DNA damage response",88,25561503,"MASCOT Score",63.0000000,1.0000000,,,,,-0.8900000
HPQWQSDDGGDNSEPESPSDSLR,ph,S,684,true,"TOR Kinase and ABA Receptor",100,29290610,XCorr,4.5009131,1.0000000,,,,0.0013780000153929,
HPQWQSDDGGDNSEPESPSDSLR,ph,S,684,true,"Lateral root-induction - NAA vs control",106,23328941,"MASCOT Score",30.0000000,,0.0909022,0.7720542,NO,,
HPQWQSDDGGDNSEPESPSDSLR,ph,S,684,true,"Phospho cell culture sucrose/TOR",109,30833711,,,1.0000000,,,,,
HPQWQSDDGGDNSEPESPSDSLR,ph,S,684,true,"Col-0 callus - FC Col-0 vs. Col-0 Xray",111a,31410901,,25.7000000,,1.4306356,0.0000000,NO,,1.3019873
HPQWQSDDGGDNSEPESPSDSLR,ph,S,684,true,"Col-0 X-ray callus - FC Col-0 vs. Col-0 Xray",111b,31410901,,25.7000000,,1.4306356,0.0000000,NO,,1.3019873
HPQWQSDDGGDNSEPESPSDSLR,ph,S,684,true,"atm callus - FC atm vs. atm Xray",111c,31410901,,25.7000000,,1.1686601,0.0000000,NO,,1.3019873
HPQWQSDDGGDNSEPESPSDSLR,ph,S,684,true,"atm-3 X-ray callus - FC atm vs. atm Xray",111d,31410901,,25.7000000,,1.1686601,0.0000000,NO,,1.3019873
HPQWQSDDGGDNSEPESPSDSLR,ph,S,684,true,"Tissue atlas Arabidopsis - ProteomicsDB",114,32188942,"MaxQuant score",236.9400000,1.0000000,,,,0,
HPQWQSDDGGDNSEPESPSDSLRDIQDISLNLK,ph,S,688,true,"Brassinosteroid-Regulated Phosphorylation Dynamics",94,26187819,"MaxQuant Score",66.3650000,0.8620000,,,,0.0010000000474975,-2.4890000
HPQWQSDDGGDNSEPESPSDSLR,ph,S,688,true,"Phytohormone-responsive phosphoproteins",34,20374526,"MASCOT Score",40.0000000,,,,,,2.4889400
HPQWQSDDGGDNSEPESPSDSLR,ph,S,688,true,"Large-scale phosphorylation discovery",44,23111157,XCorr,4.4520000,,,,,,
HPQWQSDDGGDNSEPESPSDSLR,ph,S,688,true,"PAMP-triggered phosphorylation",48,24601666,"MASCOT Score",41.7800000,,,,,,
HPQWQSDDGGDNSEPESPSDSLR,ph,S,688,true,"srk2dei ABA signaling phopshoproteomics",83,23572148,"MASCOT Score",56.0000000,,,,,,0.0005000
HPQWQSDDGGDNSEPESPSDSLR,ph,S,688,true,"LAXIC - mannitol vs control",84b,23660473,XCorr,4.1000000,0.9770000,-1.7316935,,NO,0.00053895398741588,
HPQWQSDDGGDNSEPESPSDSLR,ph,S,688,true,"SnRK2 protein kinase substrates",85,23776212,XCorr,3.9114664,0.9950000,,,,1.6418399582108E-6,
HPQWQSDDGGDNSEPESPSDSLR,ph,S,688,true,"atm and atr DNA damage response",88,25561503,"MASCOT Score",53.0000000,0.9810000,,,,,-1.5800000
HPQWQSDDGGDNSEPESPSDSLR,ph,S,688,true,"TOR Kinase and ABA Receptor",100,29290610,XCorr,4.4439421,0.9922000,,,,6.864000170026E-5,
HPQWQSDDGGDNSEPESPSDSLR,ph,S,688,true,"Lateral root-induction - NAA vs control",106,23328941,"MASCOT Score",23.0000000,,0.1027378,0.7348181,NO,,
HPQWQSDDGGDNSEPESPSDSLR,ph,S,688,true,"Phospho cell culture sucrose/TOR",109,30833711,,,0.9625150,,,,,
HPQWQSDDGGDNSEPESPSDSLR,ph,S,688,true,"Tissue atlas Arabidopsis - ProteomicsDB",114,32188942,"MaxQuant score",177.8200000,0.9761520,,,,0,
HPQWQSDDGGDNSEPESPSDSLR,ph,S,690,true,"Conserved plant phosphoproteome - Arabidopsis",61a,20466843,"MASCOT Score",49.0000000,1.0000000,,,,,
HPQWQSDDGGDNSEPESPSDSLR,ph,S,690,true,"srk2dei ABA signaling phopshoproteomics",83,23572148,"MASCOT Score",27.0000000,,,,,,-0.0005000
HPQWQSDDGGDNSEPESPSDSLRDIQDISLNLK,ph,S,692,true,"SnRK2 protein kinase substrates",85,23776212,XCorr,3.8997436,0.8170000,,,,0.0074899699538946,
DIQDISLNLK,ph,S,700,true,"STN8 phosphoproteome",38,21768351,"MASCOT Score",45.8900000,,,,,,0.0376067
DIQDISLNLK,ph,S,700,true,"srk2dei ABA signaling phopshoproteomics",83,23572148,"MASCOT Score",57.0000000,,,,,,0.0003000
DIQDISLNLK,ph,S,700,true,"SnRK2 protein kinase substrates",85,23776212,XCorr,2.1456003,1.0000000,,,,0.039768699556589,
DIQDISLNLK,ph,S,700,true,"atm and atr DNA damage response",88,25561503,"MASCOT Score",55.0000000,1.0000000,,,,,0.2800000
DIQDISLNLK,ph,S,700,true,"Tissue atlas Arabidopsis - ProteomicsDB",114,32188942,"MaxQuant score",197.4300000,1.0000000,,,,5.9310500575508E-14,
DIQDISLNLK,ph,S,700,true,"Touch-induced phosphorylation: 40s touch vs untouc",136,30291188,"MASCOT score",62.2200000,,0.2344232,0.0065122,NO,,11.2053445
FSFDGSGNDNYMNQEGSSMDR,ph,S,706,true,"atm and atr DNA damage response",88,25561503,"MASCOT Score",53.0000000,0.9950000,,,,,0.6800000
FSFDGSGNDNYMNQEGSSMDRK,ph,S,710,true,"STN8 phosphoproteome",38,21768351,"MASCOT Score",43.7800000,,,,,,
FSFDGSGNDNYMNQEGSSMDRK,ph,S,710,true,"srk2dei ABA signaling phopshoproteomics",83,23572148,"MASCOT Score",97.0000000,,,,,,0.0002000
FSFDGSGNDNYMNQEGSSMDRK,ph,S,722,true,"srk2dei ABA signaling phopshoproteomics",83,23572148,"MASCOT Score",44.0000000,,,,,,-0.0007000
KMGSLER,ph,S,747,true,"Tissue atlas Arabidopsis - ProteomicsDB",114,32188942,"MaxQuant score",62.4660000,1.0000000,,,,0.018037900328636,
SEVNSGKFPAVR,ph,S,755,true,"Tissue atlas Arabidopsis - ProteomicsDB",114,32188942,"MaxQuant score",157.0900000,1.0000000,,,,1.7606099911305E-9,
SEVNSGKFPAVR,ub,K,757,true,"upl3 mutant / wildtype",168,35926874,"MaxQuant score",57.1750000,1.0000000,0.1414328,,,0.0015521800378338,0.0991250
WASSLNEK,ph,S,878,true,"Tissue atlas Arabidopsis - ProteomicsDB",114,32188942,"MaxQuant score",89.9130000,0.9229660,,,,0.0068759899586439,
GVSCSACLHANR,so,C,999,true,"Arabidopsis S-sulfenylation chemoproteomics",108,31578252,"pFind PSM Score",0.0173785,,0.8064500,,,,-1.1076965
