Peptide,PTM,ModifiedAA,ModifiedPosition,PeptideUniqueToGene,ExperimentDesc,ExpID,PubmedID,ScoreType,IdentScore,LocProb,Log2FChange,PQ-val,QuantSig,PEP,MassErrorPPM
MTIKPAVRISDGNLIIK,ph,T,2,true,"Phosphorylation in N starvation",63,22060019,"MASCOT Score",99.0000000,,,,,,-5.9201300
ISDGNLIIKNR,ac,K,17,true,"Quantitative Acetylproteomics",101,29440448,,,,,,,,
DATVEAGDEKKESPIFR,nt,D,252,true,"Metacaspase9 substrates - in vitro rMC9",51c,23964026,"MASCOT Score",87.0000000,,,,,,-0.8091156
DATVEAGDEKK,ac,K,261,true,"Quantitative Acetylproteomics",101,29440448,,,,,,,,
KESPIFR,ph,S,264,true,"STN8 phosphoproteome",38,21768351,"MASCOT Score",45.6500000,,,,,,0.7787390
KESPIFR,ph,S,264,true,"srk2dei ABA signaling phopshoproteomics",83,23572148,"MASCOT Score",39.0000000,,,,,,-0.0004000
KESPIFR,ph,S,264,true,"TOR Kinase and ABA Receptor",100,29290610,XCorr,2.5934589,1.0000000,,,,0.019039999693632,
KESPIFR,ph,S,264,true,"Tissue atlas Arabidopsis - ProteomicsDB",114,32188942,"MaxQuant score",176.6100000,1.0000000,,,,1.9215700284932E-23,
TDVMTLQGLGLVSPKK,ph,S,357,true,"TOR Kinase and ABA Receptor",100,29290610,XCorr,2.7559023,0.9996000,,,,0.0018060000147671,
TDVMTLQGLGLVSPK,ph,S,357,true,"Phospho cell culture sucrose/TOR",109,30833711,,,0.9999990,,,,,
TDVMTLQGLGLVSPK,ph,S,357,true,"Tissue atlas Arabidopsis - ProteomicsDB",114,32188942,"MaxQuant score",268.2600000,1.0000000,,,,0,
VDVQCVLETLGGGLGGR,sno,C,386,true,"Site-specific nitrosomeproteomic id - gsnor1-3",90b,25699590,XCorr,4.7600000,,,,,3.5119999665767E-5,-7.3000000
VDVQCVLETLGGGLGGR,sno,C,386,true,"hot5-4 / wildtype, FAT-switch S-nitrosoproteome",169,37277371,,,,,,,,
DCLFADPAR,acy,C,539,false,"Arabidopsis S-acylation atlas - Hypocotyl",163b,35681017,,,,,,,,
DCLFADPAR,sno,C,539,false,"hot5-4 / wildtype, FAT-switch S-nitrosoproteome",169,37277371,,,,,,,,
YTGVLGVYNCQGAAWSSTER,ox,C,569,true,"Redox kickstart of mitochondria",112,31871212,,,,-1.1678128,0.0174775,YES,,
