Peptide,PTM,ModifiedAA,ModifiedPosition,PeptideUniqueToGene,ExperimentDesc,ExpID,PubmedID,ScoreType,IdentScore,LocProb,Log2FChange,PQ-val,QuantSig,PEP,MassErrorPPM
SISGAAVGSGR,nt,S,2,true,"Arg/N-end rule seed, prt6 vs. Wt",99,29168982,"MASCOT Score",68.9600000,,,,,0.010280000045896,-0.2892272
SISGAAVGSG,nt,S,2,true,"N-term acetylation drought responses",5,26184543,,,,,,,,
SISGAAVGSGRNL,nta,S,2,true,"Arabidopsis translation initiation landscape - NTA",167a,35069635,,,,,,,,
SISGAAVGSGR,nta,S,2,true,"Characterization plant N-terminal acetylation",6,22223895,"MASCOT Score",82.2700000,,,,,,
SISGAAVGSGR,nta,S,2,true,"Arg/N-end rule pathway Roots",80,25728785,"MASCOT Score",68.6900000,,,,,1.0339999789721E-6,
SISGAAVGSGR,nta,S,2,true,"Arg/N-end rule seed, prt6 vs. Wt",99,29168982,"MASCOT Score",68.9600000,,,,,0.010280000045896,-0.2892272
SISGAAVGSG,nta,S,2,true,"N-term acetylation drought responses",5,26184543,,,,,,,,
SISGAAVGSGR,ph,S,2,true,"atm and atr DNA damage response",88,25561503,"MASCOT Score",41.0000000,0.9950000,,,,,0.3300000
SISGAAVGSGR,ph,S,10,true,"atm and atr DNA damage response",88,25561503,"MASCOT Score",67.0000000,1.0000000,,,,,0.2200000
SISGAAVGSGR,ph,S,10,true,"Tissue atlas Arabidopsis - ProteomicsDB",114,32188942,"MaxQuant score",146.6700000,1.0000000,,,,1.6695800297839E-7,
AVEFGKTHVVRPK,ac,K,22,true,"Quantitative Acetylproteomics",101,29440448,,,,,,,,
AASLPIVVCHGK,so,C,192,true,"Arabidopsis S-sulfenylation chemoproteomics",108,31578252,"pFind PSM Score",0.0099583,,0.8238900,,,,1.3318456
AASLPIVVCHGK,so,C,192,true,"S-sulfenylation site detection using YAP1C",110,32714340,,,,,,,,
ADDVVPFKFGEK,ub,K,203,true,"upl3 mutant / wildtype",168,35926874,"MaxQuant score",53.4480000,1.0000000,,,,0.0058937901630998,-0.0017753
