Peptide,PTM,ModifiedAA,ModifiedPosition,PeptideUniqueToGene,ExperimentDesc,ExpID,PubmedID,ScoreType,IdentScore,LocProb,Log2FChange,PQ-val,QuantSig,PEP,MassErrorPPM
DPRASPSFNPLASPDSDAGIEK,ph,S,28,true,"TOR Kinase and ABA Receptor",100,29290610,XCorr,3.2372704,0.8732000,,,,0.0042619998566806,
ASPSFNPLASPDSDAGIEK,ph,S,28,true,"LAXIC - ABA stress",84a,23660473,XCorr,3.9800000,0.8550000,,,,0.0019514700397849,
ASPSFNPLASPDSDAGIEK,ph,S,28,true,"LAXIC - mannitol vs control",84b,23660473,XCorr,5.0700000,0.9300000,,,,3.2500000954339E-12,
ASPSFNPLASPDSDAGIEK,ph,S,28,true,"SnRK2 protein kinase substrates",85,23776212,XCorr,4.2573056,0.9380000,,,,7.9864602073581E-14,
ASPSFNPLASPDSDAGIEK,ph,S,28,true,"TOR Kinase and ABA Receptor",100,29290610,XCorr,5.2702518,0.9825000,,,,1.2549999439671E-7,
ASPSFNPLASPDSDAGIEK,ph,S,28,true,"Lateral root-induction - NAA vs control",106,23328941,"MASCOT Score",45.0000000,,,,,,
ASPSFNPLASPDSDAGIEK,ph,S,28,true,"Tissue atlas Arabidopsis - ProteomicsDB",114,32188942,"MaxQuant score",293.5600000,0.9998500,,,,0,
DPRASPSFNPLASPDSDAGIEK,ph,S,30,true,"TOR Kinase and ABA Receptor",100,29290610,XCorr,4.0981116,0.9824000,,,,5.0520000513643E-5,
ASPSFNPLASPDSDAGIEK,ph,S,30,true,"Lateral root-induction - NAA vs control",106,23328941,"MASCOT Score",43.0000000,,,,,,
DPRASPSFNPLASPDSDAGIEK,ph,S,36,true,"TOR Kinase and ABA Receptor",100,29290610,XCorr,3.2372704,0.9962000,,,,0.0042619998566806,
ASPSFNPLASPDSDAGIEK,ph,S,36,true,"LAXIC - mannitol vs control",84b,23660473,XCorr,5.0700000,0.9990000,,,,3.2500000954339E-12,
ASPSFNPLASPDSDAGIEK,ph,S,36,true,"SnRK2 protein kinase substrates",85,23776212,XCorr,4.2573056,1.0000000,,,,7.9864602073581E-14,
ASPSFNPLASPDSDAGIEK,ph,S,36,true,"TOR Kinase and ABA Receptor",100,29290610,XCorr,5.5250130,1.0000000,,,,3.6129998992607E-10,
ASPSFNPLASPDSDAGIEK,ph,S,36,true,"Lateral root-induction - NAA vs control",106,23328941,"MASCOT Score",43.0000000,,,,,,
ASPSFNPLASPDSDAGIEK,ph,S,36,true,"Tissue atlas Arabidopsis - ProteomicsDB",114,32188942,"MaxQuant score",338.9400000,0.9999260,,,,0,
ASPSFNPLASPDSDAGIEK,ph,S,39,true,"SnRK2 protein kinase substrates",85,23776212,XCorr,3.0421104,1.0000000,,,,4.5895299649601E-7,
ASPSFNPLASPDSDAGIEK,ph,S,39,true,"Lateral root-induction - NAA vs control",106,23328941,"MASCOT Score",41.0000000,,,,,,
SKPVPPISIPTPEIYK,ph,T,56,true,"Large-scale phosphorylation discovery",44,23111157,XCorr,4.0850000,,,,,,
SKPVPPISIPTPEIYK,ph,T,56,true,"TOR Kinase and ABA Receptor",100,29290610,XCorr,3.4933989,0.9995000,,,,0.00011419999646023,
SKPVPPISIPTPEIYK,ph,T,56,true,"Tissue atlas Arabidopsis - ProteomicsDB",114,32188942,"MaxQuant score",191.6100000,0.9993100,,,,8.8298997296725E-35,
FSGSVHKPPK,ph,S,65,true,"Large-scale phosphorylation discovery",44,23111157,XCorr,2.1780000,,,,,,
FSGSVHKPPK,ph,S,65,true,"Tissue atlas Arabidopsis - ProteomicsDB",114,32188942,"MaxQuant score",197.3000000,1.0000000,,,,2.8835699324473E-15,
IPSPEGLVR,ph,S,74,true,"SnRK2 protein kinase substrates",85,23776212,XCorr,2.4455190,1.0000000,,,,0.059508599340916,
IPSPEGLVR,ph,S,74,true,"TOR Kinase and ABA Receptor",100,29290610,XCorr,3.0965505,1.0000000,,,,0.00015439999697264,
IPSPEGLVR,ph,S,74,true,"Tissue atlas Arabidopsis - ProteomicsDB",114,32188942,"MaxQuant score",187.2200000,1.0000000,,,,2.5610700049583E-7,
SRFGEQQSFR,ph,S,101,true,"TOR Kinase and ABA Receptor",100,29290610,XCorr,2.4078274,1.0000000,,,,0.0036909999325871,
FGEQQSFR,ph,S,101,true,"TOR Kinase and ABA Receptor",100,29290610,XCorr,3.2490711,1.0000000,,,,0.0004256000102032,
FGEQQSFR,ph,S,101,true,"Lateral root-induction - NAA vs control",106,23328941,"MASCOT Score",22.0000000,,,,,,
FGEQQSFR,ph,S,101,true,"Col-0 callus - FC Col-0 vs. Col-0 Xray",111a,31410901,,48.3500000,,0.4502159,0.0000000,NO,,-0.1645108
FGEQQSFR,ph,S,101,true,"Col-0 X-ray callus - FC Col-0 vs. Col-0 Xray",111b,31410901,,48.3500000,,0.4502159,0.0000000,NO,,-0.1645108
FGEQQSFR,ph,S,101,true,"atm callus - FC atm vs. atm Xray",111c,31410901,,48.3500000,,0.3433395,0.0000000,NO,,-0.1645108
FGEQQSFR,ph,S,101,true,"atm-3 X-ray callus - FC atm vs. atm Xray",111d,31410901,,48.3500000,,0.3433395,0.0000000,NO,,-0.1645108
FGEQQSFR,ph,S,101,true,"Tissue atlas Arabidopsis - ProteomicsDB",114,32188942,"MaxQuant score",219.3500000,1.0000000,,,,5.0518698818484E-21,
SLREQFGAGSFAR,ph,S,124,true,"TOR Kinase and ABA Receptor",100,29290610,XCorr,5.0109148,1.0000000,,,,5.9730001567004E-7,
EQFGAGSFAR,ph,S,124,true,"TOR Kinase and ABA Receptor",100,29290610,XCorr,2.8431592,1.0000000,,,,0.0019320000428706,
EQFGAGSFAR,ph,S,124,true,"Col-0 callus - FC Col-0 vs. Col-0 Xray",111a,31410901,,29.8300000,,0.3979581,0.0000000,NO,,0.6895917
EQFGAGSFAR,ph,S,124,true,"Col-0 X-ray callus - FC Col-0 vs. Col-0 Xray",111b,31410901,,29.8300000,,0.3979581,0.0000000,NO,,0.6895917
EQFGAGSFAR,ph,S,124,true,"atm callus - FC atm vs. atm Xray",111c,31410901,,29.8300000,,-1.7266500,0.0000000,NO,,0.6895917
EQFGAGSFAR,ph,S,124,true,"atm-3 X-ray callus - FC atm vs. atm Xray",111d,31410901,,29.8300000,,-1.7266500,0.0000000,NO,,0.6895917
EQFGAGSFAR,ph,S,124,true,"Tissue atlas Arabidopsis - ProteomicsDB",114,32188942,"MaxQuant score",188.6800000,1.0000000,,,,9.7283403555082E-10,
GSFDRASPNNK,ph,S,134,true,"Tissue atlas Arabidopsis - ProteomicsDB",114,32188942,"MaxQuant score",128.4600000,1.0000000,,,,1.4500000361295E-5,
GSFDRASPNNKSNR,ph,S,139,true,"Tissue atlas Arabidopsis - ProteomicsDB",114,32188942,"MaxQuant score",98.8170000,1.0000000,,,,0.00010931299766526,
SNRSVASAALSK,ph,S,139,true,"TOR Kinase and ABA Receptor",100,29290610,XCorr,3.3343410,1.0000000,,,,0.00094940001145005,
SNRSVASAALSK,ph,S,142,true,"TOR Kinase and ABA Receptor",100,29290610,XCorr,3.3343410,0.9984000,,,,0.00094940001145005,
SNRSVASAALSK,ph,S,142,true,"Tissue atlas Arabidopsis - ProteomicsDB",114,32188942,"MaxQuant score",98.8170000,0.9982550,,,,0.00010931299766526,
SVASAALSK,ph,S,145,true,"Tissue atlas Arabidopsis - ProteomicsDB",114,32188942,"MaxQuant score",91.7830000,0.9960640,,,,0.0021100998856127,
VPSTGHLSFTR,ph,S,363,true,"Tissue atlas Arabidopsis - ProteomicsDB",114,32188942,"MaxQuant score",144.4700000,0.9999510,,,,4.2696200353021E-8,
VPSTGHLSFTR,ph,S,368,true,"Tissue atlas Arabidopsis - ProteomicsDB",114,32188942,"MaxQuant score",130.4700000,0.9560360,,,,1.0353400057284E-6,
