Peptide,PTM,ModifiedAA,ModifiedPosition,PeptideUniqueToGene,ExperimentDesc,ExpID,PubmedID,ScoreType,IdentScore,LocProb,Log2FChange,PQ-val,QuantSig,PEP,MassErrorPPM
DTADEEDVLLTGINSYR,nt,D,25,true,"Arg/N-end rule pathway Roots",80,25728785,"MASCOT Score",123.3100000,,,,,2.9610001206493E-7,
DTADEEDVLLTGINSYR,nt,D,25,true,"Tic56 chloroplast import - wild-type",89a,25588737,XCorr,5.9866085,,,,,,
DTADEEDVLLTGINSYR,nt,D,25,true,"Tic56 chloroplast import - ppi2",89b,25588737,XCorr,5.7643723,,,,,,
DTADEEDVLLTGINSYR,nt,D,25,true,"Tic56 chloroplast import - tic56-1",89c,25588737,XCorr,5.0058761,,,,,,
DTADEEDVLLTGINSYR,nt,D,25,true,"N-terminal ChaFRADIC",92,26010716,"MASCOT Score",84.0700000,,,,,5.385999979346E-11,
DTADEEDVLLTGINSYR,nt,D,25,true,"Stromal N-terminome",96,26371235,"MASCOT Score",127.9600000,,,,,,
DTADEEDVLLTGINSYR,nt,D,25,true,"Arg/N-end rule seed, prt6 vs. Wt",99,29168982,"MASCOT Score",63.2100000,,0.1937264,0.4905820,NO,5.7460001698928E-5,2.0699582
DTADEEDVLLTGINSYR,nt,D,25,true,"HUNTER N-terminome: legumain, GluC and trypsin",119,31951383,"MaxQuant score",321.0100000,,,,,,
DTADEEDVLLT,nt,D,25,true,"N-terminal ChaFRADIC",92,26010716,"MASCOT Score",63.0100000,,,,,1.6289999621222E-5,
EEDVLLTGINSYR,nt,E,29,true,"Tic56 chloroplast import - tic56-1",89c,25588737,XCorr,2.8093083,,,,,,
ASLNLTTLIHNHNAECLADEIADQFK,ng,N,45,true,"Conserved N-glycosylation",74,22633491,"MaxQuant Score",415.3200000,0.9510000,,,,0,-0.2410000
NQPCTNTTGSASVPGTTPGFPNLPNLLSK,ng,N,73,true,"Conserved N-glycosylation",74,22633491,"MaxQuant Score",184.2700000,0.9890000,,,,0,1.6640000
NQPCTNTTGSASVPGTTPGFPNLPNLLSK,ng,N,73,true,"N-glycan occupancy Arabidopsis glycoproteins",87,23994444,"Ladder score",50.3000000,,,,,,
NQPCTNTTGSASVPGTTPGFPNLPNLLSK,ng,N,73,true,"ER-associatied N-glycan degradation chilling stres",133,27558752,,,,,,,,
NQPCTNTTGSASVPGTTPGFPNLPNLLSK,ng,N,73,true,"UDP-GlcNAc transporter glycopeptide analysis",135,30224661,,,,,,,7.6711067375137E-18,0.6000000
DGAILPACVPNLDPSLVLTNFTMSQYSK,ng,N,125,true,"Conserved N-glycosylation",74,22633491,"MaxQuant Score",163.4200000,1.0000000,,,,2.5339680130386E-41,-0.7280000
DGAILPACVPNLDPSLVLTNFTMSQYSK,ng,N,125,true,"N-glycan occupancy Arabidopsis glycoproteins",87,23994444,"Ladder score",55.2000000,,,,,,
DGAILPACVPNLDPSLVLTNFTMSQYSK,ng,N,125,true,"UDP-GlcNAc transporter glycopeptide analysis",135,30224661,,,,,,,9.9483156645874E-7,1.0000000
