Peptide,PTM,ModifiedAA,ModifiedPosition,PeptideUniqueToGene,ExperimentDesc,ExpID,PubmedID,ScoreType,IdentScore,LocProb,Log2FChange,PQ-val,QuantSig,PEP,MassErrorPPM
NTDGENLLFTVFNQYR,nt,N,26,true,"Tic56 chloroplast import - wild-type",89a,25588737,XCorr,4.8767648,,,,,,
NTDGENLLFTVFNQYR,nt,N,26,true,"Tic56 chloroplast import - tic56-1",89c,25588737,XCorr,4.9659662,,,,,,
NTDGENLLFTVFNQYR,nt,N,26,true,"Stromal N-terminome",96,26371235,"MASCOT Score",102.0400000,,,,,,
NTDGENLLFTVFNQYR,nt,N,26,true,"HUNTER N-terminome: legumain, GluC and trypsin",119,31951383,"MaxQuant score",120.7700000,,,,,,
ESVNLTNLKK,ng,N,45,true,"Conserved N-glycosylation",74,22633491,"MaxQuant Score",113.5100000,1.0000000,,,,3.3450000955781E-6,-0.1180000
ESVNLTNLKK,ng,N,45,true,"N-glycan occupancy Arabidopsis glycoproteins",87,23994444,"Ladder score",68.4000000,,,,,,
ESVNLTNLKK,ng,N,45,true,"N-linked Glycan Micro-heterogeneity Arabidopsis",134,29237727,,,,,,,,
ESVNLTNLKK,ng,N,45,true,"UDP-GlcNAc transporter glycopeptide analysis",135,30224661,,,,,,,1.9227771190344E-5,0.9000000
ESVNLTNLK,ng,N,45,true,"UDP-GlcNAc transporter glycopeptide analysis",135,30224661,,,,,,,4.4588127821044E-6,0.5000000
NAECLADEVVDQLQNQPCTNTTGSASVPGTDPGIPNFPNLLAK,ng,N,73,true,"Conserved N-glycosylation",74,22633491,"MaxQuant Score",192.8000000,0.9910000,,,,0,2.4060000
NAECLADEVVDQLQNQPCTNTTGSASVPGTDPGIPNFPNLLAK,ng,N,73,true,"UDP-GlcNAc transporter glycopeptide analysis",135,30224661,,,,,,,4.9977165872406E-6,0.5000000
LNTNVTRDGLILQVCAPK,ng,N,102,true,"Conserved N-glycosylation",74,22633491,"MaxQuant Score",119.4400000,0.9830000,,,,0.00036870001349598,-0.4480000
LNTNVTR,ng,N,102,true,"UDP-GlcNAc transporter glycopeptide analysis",135,30224661,,,,,,,0.078891187906265,0.3000000
DGLILQVCAPK,sno,C,113,true,"hot5-4 / wildtype, FAT-switch S-nitrosoproteome",169,37277371,,,,-0.3524894,0.0000016,NO,,
