Peptide,PTM,ModifiedAA,ModifiedPosition,PeptideUniqueToGene,ExperimentDesc,ExpID,PubmedID,ScoreType,IdentScore,LocProb,Log2FChange,PQ-val,QuantSig,PEP,MassErrorPPM
SSTNFSQKR,ph,T,57,true,"SIRK1 phosphorylation",86a,23820729,"MaxQuant Score",109.0300000,1.0000000,,,,0.064000003039837,6.1990000
SSTNFSQKR,ph,T,57,true,"SIRK1 exp - sirk1 mutant vs WT",86b,23820729,,,,-0.4562487,,NO,,
SSTNFSQKR,ph,T,57,true,"SIRK1 exp - 35S:SIRK1 vs WT",86c,23820729,,,,-0.7764263,,NO,,
SSTNFSQKR,ph,S,60,true,"SIRK1 phosphorylation",86a,23820729,"MaxQuant Score",109.0300000,1.0000000,,,,0.064000003039837,6.1990000
SSTNFSQKR,ph,S,60,true,"SIRK1 exp - sirk1 mutant vs WT",86b,23820729,,,,-0.4562487,,NO,,
SSTNFSQKR,ph,S,60,true,"SIRK1 exp - 35S:SIRK1 vs WT",86c,23820729,,,,-0.7764263,,NO,,
SLNSVAGESKVQELETEKRDPR,nt,S,67,true,"Stromal N-terminome",96,26371235,"MASCOT Score",47.6000000,,,,,,
SLNSVAGESKVQELETEKRDPR,nt,S,67,true,"HUNTER N-terminome: legumain, GluC and trypsin",119,31951383,"MaxQuant score",74.5790000,,,,,,
SLNSVAGESKVQELETEKR,nt,S,67,true,"Stromal N-terminome",96,26371235,"MASCOT Score",73.1900000,,,,,,
SLNSVAGESKVQELETEKR,nt,S,67,true,"HUNTER N-terminome: legumain, GluC and trypsin",119,31951383,"MaxQuant score",167.2400000,,,,,,
SLNSVAGESKVQELE,nt,S,67,true,"N-terminal ChaFRADIC",92,26010716,"MASCOT Score",29.3700000,,,,,2.749000032054E-6,
SLNSVAGESKVQE,nt,S,67,true,"N-terminal ChaFRADIC",92,26010716,"MASCOT Score",34.4300000,,,,,2.8720000955218E-7,
SLNSVAGE,nt,S,67,true,"N-terminal ChaFRADIC",92,26010716,"MASCOT Score",53.2400000,,,,,0.047439999878407,
SLNSVAGESKVQE,nta,S,67,true,"N-terminal ChaFRADIC",92,26010716,"MASCOT Score",23.8200000,,,,,0.00083650002488866,
SVAGESKVQELETEKR,nt,S,70,true,"Stromal N-terminome",96,26371235,"MASCOT Score",36.4700000,,,,,,
SVAGESKVQELETEKR,nt,S,70,true,"HUNTER N-terminome: legumain, GluC and trypsin",119,31951383,"MaxQuant score",77.3240000,,,,,,
VAGESKVQELETEKR,nt,V,71,true,"HUNTER N-terminome: legumain, GluC and trypsin",119,31951383,"MaxQuant score",68.4810000,,,,,,
VAGESKVQE,nt,V,71,true,"N-terminal ChaFRADIC",92,26010716,"MASCOT Score",23.9800000,,,,,0.0066370000131428,
VAGESKVQE,nta,V,71,true,"N-terminal ChaFRADIC",92,26010716,"MASCOT Score",23.9800000,,,,,0.0066370000131428,
VQELETEKR,ac,K,84,true,"Quantitative Acetylproteomics",101,29440448,,,,,,,,
TVASIILGGGAGTR,ph,T,101,true,"atm and atr DNA damage response",88,25561503,"MASCOT Score",90.0000000,1.0000000,,,,,0.6300000
LFPLTKR,ac,K,108,false,"Quantitative Acetylproteomics",101,29440448,,,,,,,,
AKPAVPIGGAYR,ac,K,112,true,"Quantitative Acetylproteomics",101,29440448,,,,,,,,
LIDVPMSNCINSGINK,ox,C,131,true,"SPEAR - 10 mM H2O2 / mock",138a,34619326,,,,3.5331064,0.0330974,YES,,
LIDVPMSNCINSGINK,sno,C,131,true,"Site-specific nitrosomeproteomic id - gsnor1-3",90a,25699590,XCorr,3.9788783,,,,,7.1720001869835E-5,-4.9130214
WFQGTADAVR,ph,T,190,false,"atm and atr DNA damage response",88,25561503,"MASCOT Score",50.0000000,1.0000000,,,,,0.3100000
WFQGTADAVR,ph,T,190,false,"Tissue atlas Arabidopsis - ProteomicsDB",114,32188942,"MaxQuant score",88.1870000,1.0000000,,,,0.0042554601095617,
QFHWLFEDAR,nt,Q,196,true,"HUNTER N-terminome: legumain, GluC and trypsin",119,31951383,"MaxQuant score",45.1370000,,,,,,
QSGADISISCIPIDDR,nt,Q,234,true,"HUNTER N-terminome: legumain, GluC and trypsin",119,31951383,"MaxQuant score",173.6800000,,,,,,
QSGADISISCIPIDDR,sno,C,243,true,"Site-specific nitrosomeproteomic id - gsnor1-3",90b,25699590,XCorr,2.7600000,,,,,0.00070309999864548,-6.8600000
RASDFGLMK,ph,S,252,true,"atm and atr DNA damage response",88,25561503,"MASCOT Score",23.0000000,1.0000000,,,,,-1.7600000
RASDFGLMK,ph,S,252,true,"Tissue atlas Arabidopsis - ProteomicsDB",114,32188942,"MaxQuant score",65.8950000,1.0000000,,,,0.0054006897844374,
VISFSEKPK,ph,S,267,true,"atm and atr DNA damage response",88,25561503,"MASCOT Score",27.0000000,1.0000000,,,,,-2.6900000
VISFSEKPK,ac,K,271,true,"Histone deacetylases - apicidin vs control",98a,29061669,"MaxQuant Score",121.5000000,1.0000000,0.0790000,0.6194411,NO,0.0060000000521541,
VISFSEKPK,ac,K,271,true,"Quantitative Acetylproteomics",101,29440448,,,,,,,,
NLPPSKIDNSK,ac,K,393,true,"Quantitative Acetylproteomics",101,29440448,,,,,,,,
SRVGSNVQLK,ph,S,424,true,"Tissue atlas Arabidopsis - ProteomicsDB",114,32188942,"MaxQuant score",72.5310000,0.8291450,,,,0.0087944203987718,
VGSNVQLK,ph,S,428,true,"STN8 phosphoproteome",38,21768351,"MASCOT Score",76.4100000,,,,,,0.0222782
VGSNVQLK,ph,S,428,true,"Chloroplast kinase substrates",60,19376835,"MASCOT Score",58.7200000,,,,,,-0.3451060
VGSNVQLK,ph,S,428,true,"srk2dei ABA signaling phopshoproteomics",83,23572148,"MASCOT Score",40.0000000,,,,,,-0.0006000
VGSNVQLK,ph,S,428,true,"atm and atr DNA damage response",88,25561503,"MASCOT Score",41.0000000,1.0000000,,,,,-1.9800000
VGSNVQLK,ph,S,428,true,"TOR Kinase and ABA Receptor",100,29290610,XCorr,3.3438051,1.0000000,,,,0.00041999999666587,
VGSNVQLK,ph,S,428,true,"Tissue atlas Arabidopsis - ProteomicsDB",114,32188942,"MaxQuant score",163.6500000,1.0000000,,,,0.00093581300461665,
VGKNVIIANSEGIQEADR,nt,V,479,true,"Stromal N-terminome",96,26371235,"MASCOT Score",77.7700000,,,,,,
