Peptide,PTM,ModifiedAA,ModifiedPosition,PeptideUniqueToGene,ExperimentDesc,ExpID,PubmedID,ScoreType,IdentScore,LocProb,Log2FChange,PQ-val,QuantSig,PEP,MassErrorPPM
ADLDVPPQVPQSKTR,nt,A,2,true,"N-terminal ChaFRADIC",92,26010716,"MASCOT Score",40.2000000,,,,,4.0200000512414E-5,
ADLDVPPQVPQSKTR,nt,A,2,true,"Arg/N-end rule seed, prt6 vs. Wt",99,29168982,"MASCOT Score",24.3500000,,,,,0.023019999265671,-7.2083456
ADLDVPPQVP,nt,A,2,true,"N-term acetylation drought responses",5,26184543,,,,,,,,
ADLDVPPQVPQSKTRD,nta,A,2,true,"Arabidopsis translation initiation landscape - NTA",167a,35069635,,,,,,,,
ADLDVPPQVPQSKTR,nta,A,2,true,"N-terminal ChaFRADIC",92,26010716,"MASCOT Score",40.2000000,,,,,4.0200000512414E-5,
ADLDVPPQVPQSKTR,nta,A,2,true,"Arg/N-end rule seed, prt6 vs. Wt",99,29168982,"MASCOT Score",24.3500000,,-0.2573867,0.0344307,NO,0.023019999265671,-7.2083456
ADLDVPPQVPQSK,nta,A,2,true,"Characterization plant N-terminal acetylation",6,22223895,"MASCOT Score",51.6100000,,,,,,
ADLDVPPQVP,nta,A,2,true,"N-term acetylation drought responses",5,26184543,,,,,,,,
ETIKPMVDGGTEGFKGHAR,ub,K,185,true,"upl3 mutant / wildtype",168,35926874,"MaxQuant score",151.4100000,1.0000000,-0.8287932,0.3473200,NO,1.7536200551791E-19,-0.0794460
FPLCTLAETPR,ox,C,215,true,"SPEAR - 10 mM H2O2 / mock",138a,34619326,,,,0.6011806,0.0308453,YES,,
FPLCTLAETPR,sno,C,215,true,"hot5-4 / wildtype, FAT-switch S-nitrosoproteome",169,37277371,,,,0.1032701,0.5885149,NO,,
FPLCTLAETPR,ph,T,220,true,"Tissue atlas Arabidopsis - ProteomicsDB",114,32188942,"MaxQuant score",131.6600000,0.9999800,,,,9.5566301752115E-6,
IVSACSK,so,C,310,true,"Arabidopsis S-sulfenylation chemoproteomics",108,31578252,"pFind PSM Score",0.1123870,,,,,,1.2874185
LSKPLYDLMGR,ub,K,401,true,"upl3 mutant / wildtype",168,35926874,"MaxQuant score",123.6700000,1.0000000,-0.3827015,0.2350400,NO,2.6134600830119E-6,0.3986300
VVFKGADGVADMDTAIGA,ub,K,440,true,"upl3 mutant / wildtype",168,35926874,"MaxQuant score",59.7280000,1.0000000,0.3334237,,,0.00082177901640534,2.6272000
