Peptide,PTM,ModifiedAA,ModifiedPosition,PeptideUniqueToGene,ExperimentDesc,ExpID,PubmedID,ScoreType,IdentScore,LocProb,Log2FChange,PQ-val,QuantSig,PEP,MassErrorPPM
SSTSEADAESVLR,nt,S,46,true,"N-terminal ChaFRADIC",92,26010716,"MASCOT Score",68.1600000,,,,,6.8210001700209E-6,
SSTSEADAESVLR,nt,S,46,true,"Stromal N-terminome",96,26371235,"MASCOT Score",47.2300000,,,,,,
SSTSEADAESVLR,nt,S,46,true,"Arg/N-end rule seed, prt6 vs. Wt",99,29168982,"MASCOT Score",67.7000000,,0.0703922,0.8699396,NO,0.010209999978542,1.5811783
SSTSEADAESVLR,nt,S,46,true,"FtsH12 N-terminome: WT / FtsH12 knockdown miRNA",118,33216923,"MaxQuant score",84.7530000,,,,,0.0018366000149399,
SSTSEADAESVLR,nta,S,46,true,"Characterization plant N-terminal acetylation",6,22223895,"MASCOT Score",89.2900000,,,,,,
SSTSEADAESVLR,nta,S,46,true,"N-terminal ChaFRADIC",92,26010716,"MASCOT Score",68.1600000,,,,,6.8210001700209E-6,
SSTSEADAESVLR,nta,S,46,true,"Stromal N-terminome",96,26371235,"MASCOT Score",47.2300000,,,,,,
SSTSEADAESVLR,nta,S,46,true,"Arg/N-end rule seed, prt6 vs. Wt",99,29168982,"MASCOT Score",67.7000000,,,,,0.010209999978542,1.5811783
SSTSEADAESVLR,nta,S,46,true,"FtsH12 N-terminome: WT / FtsH12 knockdown miRNA",118,33216923,"MaxQuant score",45.9150000,,,,,1.3400000170805E-5,
SSTSEADAESVLR,nta,S,46,true,"HUNTER N-terminome: legumain, GluC and trypsin",119,31951383,"MaxQuant score",169.2100000,,,,,,
SSTSEADAESVLR,nta,S,46,true,"Arabidopsis translation initiation landscape - NTA",167a,35069635,,,,,,,,
TVTPSLDLKR,ac,K,67,true,"Quantitative Acetylproteomics",101,29440448,,,,,,,,
VLNCEVDEQNAEDQLR,sno,C,236,true,"Site-specific nitrosomeproteomic id - gsnor1-3",90a,25699590,XCorr,3.7500000,,,,,0.018030000850558,-5.1400000
VLNCEVDEQNAEDQLR,sno,C,236,true,"Site-specific nitrosomeproteomic id - gsnor1-3",90b,25699590,XCorr,4.4600000,,,,,0.010099999606609,-7.1300000
SVSIYGSPR,ph,S,282,true,"atm and atr DNA damage response",88,25561503,"MASCOT Score",53.0000000,0.9970000,,,,,0.5500000
SVSIYGSPR,ph,S,282,true,"Tissue atlas Arabidopsis - ProteomicsDB",114,32188942,"MaxQuant score",80.9790000,0.9992790,,,,0.0042949398048222,
