Peptide,PTM,ModifiedAA,ModifiedPosition,PeptideUniqueToGene,ExperimentDesc,ExpID,PubmedID,ScoreType,IdentScore,LocProb,Log2FChange,PQ-val,QuantSig,PEP,MassErrorPPM
MLGIFSGAIVSPPEELVAAGSR,nta,M,1,true,"Stromal N-terminome",96,26371235,"MASCOT Score",63.8800000,,,,,,
MLGIFSGAIVSPPEELVAAGSR,nta,M,1,true,"FtsH12 N-terminome: WT / FtsH12 knockdown miRNA",118,33216923,"MaxQuant score",140.1000000,,,,,3.6499999580894E-34,
MLGIFSGAIVSPPEELVAAGSR,nta,M,1,true,"HUNTER N-terminome: legumain, GluC and trypsin",119,31951383,"MaxQuant score",167.5500000,,,,,,
MLGIFSGAIVSPPEELVAAGSR,nta,M,1,true,"Arabidopsis translation initiation landscape - NTA",167a,35069635,,,,,,,,
MLGIFSGAIVSPPEE,nta,M,1,true,"Arg/N-end rule seed, prt6 vs. Wt",99,29168982,"MASCOT Score",41.0400000,,,,,5.8789999457076E-5,-1.7180613
MLGIFSGAIV,nta,M,1,true,"N-term acetylation drought responses",5,26184543,,,,,,,,
SGAIVSPPEELVAAGSR,nt,S,6,true,"Arg/N-end rule seed, prt6 vs. Wt",99,29168982,"MASCOT Score",22.7300000,,-1.0594590,0.3195083,NO,0.10230000317097,-1.0857025
MLGIFSGAIVSPPEELVAAGSRTPSPK,ph,S,21,true,"TOR Kinase and ABA Receptor",100,29290610,XCorr,4.0190177,0.8775000,,,,8.5680003394373E-6,
MLGIFSGAIVSPPEELVAAGSRTPSPK,ph,T,23,true,"TOR Kinase and ABA Receptor",100,29290610,XCorr,3.5709639,0.8995000,,,,1.5760000678711E-5,
MLGIFSGAIVSPPEELVAAGSRTPSPK,ph,S,25,true,"TOR Kinase and ABA Receptor",100,29290610,XCorr,4.7853584,0.7851000,,,,3.6710000017592E-7,
