Peptide,PTM,ModifiedAA,ModifiedPosition,PeptideUniqueToGene,ExperimentDesc,ExpID,PubmedID,ScoreType,IdentScore,LocProb,Log2FChange,PQ-val,QuantSig,PEP,MassErrorPPM
NILANADCK,sno,C,163,false,"hot5-4 / wildtype, FAT-switch S-nitrosoproteome",169,37277371,,,,,,,,
NILANADCK,so,C,163,false,"S-sulfenylation site detection using YAP1C",110,32714340,,,,,,,,
ICDFGLAR,ox,C,168,false,"SPEAR - 50 mM H2O2 / mock",138b,34619326,,,,1.8133062,0.0349409,YES,,
ICDFGLAR,so,C,168,false,"S-sulfenylation site detection using YAP1C",110,32714340,,,,,,,,
VAFNDTPTAIFWTDYVATR,ph,T,187,true,"Brassinosteroid-Regulated Phosphorylation Dynamics",94,26187819,"MaxQuant Score",205.0200000,1.0000000,,,,0,-1.5190000
VAFNDTPTAIFWTDYVATR,ph,Y,189,true,"SnRK2 protein kinase substrates",85,23776212,XCorr,2.9538598,1.0000000,,,,0.0004453030123841,
VAFNDTPTAIFWTDYVATR,ph,Y,189,true,"Brassinosteroid-Regulated Phosphorylation Dynamics",94,26187819,"MaxQuant Score",205.0200000,1.0000000,,,,0,-1.5190000
VAFNDTPTAIFWTDYVATR,ph,Y,189,true,"TOR Kinase and ABA Receptor",100,29290610,XCorr,5.5596876,1.0000000,,,,1.3440000223852E-9,
VAFNDTPTAIFWTDYVATR,ph,Y,189,true,"Tyrosine phosphorylation - flg22 vs mock",105,22074104,"MASCOT Score",70.1000000,,-0.0100000,,YES,,
VAFNDTPTAIFWTDYVATR,ph,Y,189,true,"Tissue atlas Arabidopsis - ProteomicsDB",114,32188942,"MaxQuant score",102.6500000,0.8797910,,,,8.8253997887477E-8,
VAFNDTPTAIFWTDYVATR,ph,T,192,true,"Tyrosine phosphorylation - flg22 vs mock",105,22074104,"MASCOT Score",53.9300000,,,,,,8.8794590
QQHASLPR,ph,S,412,true,"atm and atr DNA damage response",88,25561503,"MASCOT Score",34.0000000,1.0000000,,,,,1.2300000
QQHASLPR,ph,S,412,true,"TOR Kinase and ABA Receptor",100,29290610,XCorr,2.0871239,1.0000000,,,,0.050230000168085,
QQHASLPR,ph,S,412,true,"Tissue atlas Arabidopsis - ProteomicsDB",114,32188942,"MaxQuant score",115.2300000,1.0000000,,,,0.0032727499492466,
QHASLPR,ph,S,412,false,"TOR Kinase and ABA Receptor",100,29290610,XCorr,2.1208539,1.0000000,,,,0.01541000045836,
QHASLPR,ph,S,412,false,"Tissue atlas Arabidopsis - ProteomicsDB",114,32188942,"MaxQuant score",116.1200000,1.0000000,,,,0.0073106801137328,
NPAAASQYPKR,ub,K,520,true,"Arabidopsis ubiquitination COFRADIC",40,26744219,"MaxQuant Score",128.0100000,1.0000000,,,,1.7899999704696E-7,0.3540000
SNRGDEDCATAAEGPSR,ox,C,534,true,"OxiTRAQ Arabidopsis - 5 mM H2O2 versus control",47,24376095,,,,0.0064812,0.2993490,NO,,
GDEDCATAAEGPSR,ox,C,534,true,"OxiTRAQ Arabidopsis - 5 mM H2O2 versus control",47,24376095,,,,-0.0276125,0.7333409,NO,,
