Peptide,PTM,ModifiedAA,ModifiedPosition,PeptideUniqueToGene,ExperimentDesc,ExpID,PubmedID,ScoreType,IdentScore,LocProb,Log2FChange,PQ-val,QuantSig,PEP,MassErrorPPM
EHNHELGGEGSVEETTPRPSR,ph,S,136,true,"TOR Kinase and ABA Receptor",100,29290610,XCorr,3.7340462,0.7926000,,,,0.04399000108242,
EHNHELGGEGSVEETTPRPSR,ph,S,136,true,"Tissue atlas Arabidopsis - ProteomicsDB",114,32188942,"MaxQuant score",211.6200000,0.9998330,,,,0,
EHNHELGGEGSVEETTPR,ph,S,136,true,"atm and atr DNA damage response",88,25561503,"MASCOT Score",72.0000000,1.0000000,,,,,0.3600000
LGVTVNPHRPK,ph,T,156,true,"Tissue atlas Arabidopsis - ProteomicsDB",114,32188942,"MaxQuant score",66.7080000,1.0000000,,,,0.002350949915126,
VVDESDRETR,ph,S,170,true,"Tissue atlas Arabidopsis - ProteomicsDB",114,32188942,"MaxQuant score",70.6220000,0.9924690,,,,0.0014681200264022,
FKGGGGEGEVSDDHHQTQQAK,ph,S,194,true,"Tissue atlas Arabidopsis - ProteomicsDB",114,32188942,"MaxQuant score",100.7000000,0.9988200,,,,1.1735800109491E-9,
GGGGEGEVSDDHHQTQQAK,ph,S,194,true,"TOR Kinase and ABA Receptor",100,29290610,XCorr,3.9084153,1.0000000,,,,8.0520003393758E-5,
RQDSGGWIVDR,ph,S,283,false,"Tissue atlas Arabidopsis - ProteomicsDB",114,32188942,"MaxQuant score",79.6140000,1.0000000,,,,0.001005640020594,
YEEGAISR,nta,Y,654,false,"Arabidopsis translation initiation landscape - NTA",167a,35069635,,,,,,,,
