Peptide,PTM,ModifiedAA,ModifiedPosition,PeptideUniqueToGene,ExperimentDesc,ExpID,PubmedID,ScoreType,IdentScore,LocProb,Log2FChange,PQ-val,QuantSig,PEP,MassErrorPPM
DSSTGSSSSSSSSQVK,fuc,S,23,true,"SPINDLY O-fucosylation",162,36739885,,,,,,,-0.72000002861023,
RKASLPNYER,ph,S,77,true,"srk2dei ABA signaling phopshoproteomics",83,23572148,"MASCOT Score",31.0000000,,,,,,-0.0005000
RKASLPNYER,ph,S,77,true,"TOR Kinase and ABA Receptor",100,29290610,XCorr,2.3046055,1.0000000,,,,0.0051359999924898,
KASLPNYER,ph,S,77,true,"STN8 phosphoproteome",38,21768351,"MASCOT Score",49.5300000,,,,,,-0.4448540
KASLPNYER,ph,S,77,true,"Tyrosine phosphorylation in Arabidopsis",59,18463617,"MASCOT Score",22.0000000,,,,,,0.0000000
KASLPNYER,ph,S,77,true,"Chloroplast kinase substrates",60,19376835,"MASCOT Score",49.9600000,,,,,,-4.1909400
KASLPNYER,ph,S,77,true,"atm and atr DNA damage response",88,25561503,"MASCOT Score",48.0000000,1.0000000,,,,,0.5000000
KASLPNYER,ph,S,77,true,"Tissue atlas Arabidopsis - ProteomicsDB",114,32188942,"MaxQuant score",173.7600000,1.0000000,,,,2.8165599360364E-5,
ASLPNYER,ph,S,77,true,"atm and atr DNA damage response",88,25561503,"MASCOT Score",23.0000000,1.0000000,,,,,0.0800000
LLLSPSVSETSEKPLVASPITSPYWK,ph,S,90,true,"Large-scale phosphorylation discovery",44,23111157,XCorr,4.4910000,,,,,,
LLLSPSVSETSEKPLVASPITSPYWK,ub,K,97,true,"upl3 mutant / wildtype",168,35926874,"MaxQuant score",58.9380000,1.0000000,-0.7226103,,,2.2599699605053E-6,1.6561000
CLSLPSSNSAK,ph,S,114,true,"Tyrosine phosphorylation in Arabidopsis",59,18463617,"MASCOT Score",22.0000000,,,,,,-2.0120254
CLSLPSSNSAK,ph,S,114,true,"atm and atr DNA damage response",88,25561503,"MASCOT Score",70.0000000,1.0000000,,,,,-0.0700000
CLSLPSSNSAK,ph,S,114,true,"Tissue atlas Arabidopsis - ProteomicsDB",114,32188942,"MaxQuant score",184.4800000,1.0000000,,,,4.7788101299438E-20,
LSLVVSTTPVSAVVHSEQPK,ph,T,130,true,"Tissue atlas Arabidopsis - ProteomicsDB",114,32188942,"MaxQuant score",131.5900000,0.9317330,,,,1.841470045121E-21,
AVSFDDNK,ph,S,167,true,"Tyrosine phosphorylation in Arabidopsis",59,18463617,"MASCOT Score",34.0000000,,,,,,-1.0263003
AVSFDDNK,ph,S,167,true,"atm and atr DNA damage response",88,25561503,"MASCOT Score",31.0000000,1.0000000,,,,,-1.4300000
AVSFDDNK,ph,S,167,true,"Phospho cell culture sucrose/TOR",109,30833711,,,1.0000000,,,,,
AVSFDDNK,ph,S,167,true,"Tissue atlas Arabidopsis - ProteomicsDB",114,32188942,"MaxQuant score",113.1500000,1.0000000,,,,0.0034480099566281,
VPTINQLTNRR,ph,T,265,true,"Tissue atlas Arabidopsis - ProteomicsDB",114,32188942,"MaxQuant score",189.2400000,1.0000000,,,,1.146059983026E-10,
VPTINQLTNR,ph,T,265,true,"atm and atr DNA damage response",88,25561503,"MASCOT Score",37.0000000,1.0000000,,,,,-0.6200000
VPTINQLTNR,ph,T,265,true,"TOR Kinase and ABA Receptor",100,29290610,XCorr,2.6261106,1.0000000,,,,0.0040600001811981,
