Peptide,PTM,ModifiedAA,ModifiedPosition,PeptideUniqueToGene,ExperimentDesc,ExpID,PubmedID,ScoreType,IdentScore,LocProb,Log2FChange,PQ-val,QuantSig,PEP,MassErrorPPM
SLDSGISEIATSPSFRN,nt,S,62,true,"HUNTER N-terminome: legumain, GluC and trypsin",119,31951383,"MaxQuant score",192.1800000,,,,,,
SLDSGISEIATSPSFR,nt,S,62,true,"Tic56 chloroplast import - ppi2",89b,25588737,XCorr,3.6590559,,,,,,
SLDSGISEIATSPSFR,nt,S,62,true,"Tic56 chloroplast import - tic56-1",89c,25588737,XCorr,4.2475452,,,,,,
SLDSGISEIATSPSFR,nt,S,62,true,"N-terminal ChaFRADIC",92,26010716,"MASCOT Score",55.2300000,,,,,7.9460003021836E-9,
SLDSGISEIATSPSFR,nt,S,62,true,"Arg/N-end rule seed, prt6 vs. Wt",99,29168982,"MASCOT Score",61.5900000,,0.0775751,0.6680955,NO,0.0010870000114664,-3.4219350
SLDSGISEIATSPSFR,nt,S,62,true,"FtsH12 N-terminome: WT / FtsH12 knockdown miRNA",118,33216923,"MaxQuant score",82.0690000,,,,,0.0047420999035239,
SLDSGISEIATSPSFR,nt,S,62,true,"HUNTER N-terminome: legumain, GluC and trypsin",119,31951383,"MaxQuant score",241.3500000,,,,,,
SLDSGISEIATSPSFRN,nta,S,62,true,"HUNTER N-terminome: legumain, GluC and trypsin",119,31951383,"MaxQuant score",128.5400000,,,,,,
SLDSGISEIATSPSFR,nta,S,62,true,"HUNTER N-terminome: legumain, GluC and trypsin",119,31951383,"MaxQuant score",170.1800000,,,,,,
LDSGISEIATSPSFR,nt,L,63,true,"Arg/N-end rule seed, prt6 vs. Wt",99,29168982,"MASCOT Score",29.4900000,,0.4548773,0.2517363,NO,0.041659999638796,-2.4056525
LDSGISEIATSPSFR,nt,L,63,true,"FtsH12 N-terminome: WT / FtsH12 knockdown miRNA",118,33216923,"MaxQuant score",57.3480000,,,,,0.017690999433398,
LDSGISEIATSPSFR,nt,L,63,true,"HUNTER N-terminome: legumain, GluC and trypsin",119,31951383,"MaxQuant score",77.1240000,,,,,,
LDSGISEIATSPSFRN,nta,L,63,true,"HUNTER N-terminome: legumain, GluC and trypsin",119,31951383,"MaxQuant score",107.8500000,,,,,,
LDSGISEIATSPSFR,nta,L,63,true,"HUNTER N-terminome: legumain, GluC and trypsin",119,31951383,"MaxQuant score",122.8600000,,,,,,
IDYEATKNSLVAGK,ac,K,186,true,"Quantitative Acetylproteomics",101,29440448,,,,,,,,
