Peptide,PTM,ModifiedAA,ModifiedPosition,PeptideUniqueToGene,ExperimentDesc,ExpID,PubmedID,ScoreType,IdentScore,LocProb,Log2FChange,PQ-val,QuantSig,PEP,MassErrorPPM
ATTRKLVVEVV,nta,A,2,true,"Arabidopsis translation initiation landscape - NTA",167a,35069635,,,,,,,,
TEETKAEGPDESK,ph,S,168,true,"Tissue atlas Arabidopsis - ProteomicsDB",114,32188942,"MaxQuant score",66.6210000,0.9969990,,,,0.0078683495521545,
SPLPEVIISR,ph,S,266,true,"Phosphorylation Early Elicitor Signaling",23,17317660,,,,,,,,
SPLPEVIISR,ph,S,266,true,"Col-0 callus - FC Col-0 vs. Col-0 Xray",111a,31410901,,30.1800000,,0.6927298,0.0000000,NO,,0.3369531
SPLPEVIISR,ph,S,266,true,"Col-0 X-ray callus - FC Col-0 vs. Col-0 Xray",111b,31410901,,30.1800000,,0.6927298,0.0000000,NO,,0.3369531
SPLPEVIISR,ph,S,266,true,"atm callus - FC atm vs. atm Xray",111c,31410901,,30.1800000,,0.6387277,0.0000000,NO,,0.3369531
SPLPEVIISR,ph,S,266,true,"atm-3 X-ray callus - FC atm vs. atm Xray",111d,31410901,,30.1800000,,0.6387277,0.0000000,NO,,0.3369531
SPLPEVIISR,ph,S,266,true,"Tissue atlas Arabidopsis - ProteomicsDB",114,32188942,"MaxQuant score",94.3090000,1.0000000,,,,0.00068571500014514,
SVSGSIPETK,ph,S,278,true,"atm and atr DNA damage response",88,25561503,"MASCOT Score",46.0000000,0.9370000,,,,,-1.4500000
SVSGSIPETK,ph,S,278,true,"Phospho cell culture sucrose/TOR",109,30833711,,,0.9995280,,,,,
SVSGSIPETK,ph,S,278,true,"Tissue atlas Arabidopsis - ProteomicsDB",114,32188942,"MaxQuant score",203.0300000,0.9999650,,,,2.3827299436108E-19,
SVSETASYTSEISDVSTIER,ph,S,296,true,"Phospho cell culture sucrose/TOR",109,30833711,,,0.7875570,,,,,
SVSETASYTSEISDVSTIER,ph,S,296,true,"Tissue atlas Arabidopsis - ProteomicsDB",114,32188942,"MaxQuant score",259.9500000,0.9901320,,,,0,
RLPSLSDR,ph,S,1043,false,"Tissue atlas Arabidopsis - ProteomicsDB",114,32188942,"MaxQuant score",132.8500000,0.9993240,,,,0.0021190301049501,
