Peptide,PTM,ModifiedAA,ModifiedPosition,PeptideUniqueToGene,ExperimentDesc,ExpID,PubmedID,ScoreType,IdentScore,LocProb,Log2FChange,PQ-val,QuantSig,PEP,MassErrorPPM
TEVSRDANVTVVDR,ph,S,100,true,"atm and atr DNA damage response",88,25561503,"MASCOT Score",33.0000000,0.9080000,,,,,-0.3900000
DANVTVVDR,ph,T,106,true,"Tissue atlas Arabidopsis - ProteomicsDB",114,32188942,"MaxQuant score",109.2400000,1.0000000,,,,0.0014976300299168,
GGDESFTVESFVGAEK,ph,S,120,true,"Tissue atlas Arabidopsis - ProteomicsDB",114,32188942,"MaxQuant score",131.8200000,0.9991720,,,,7.6980597896181E-8,
LIENDGTGAEQSR,ph,T,201,true,"Tissue atlas Arabidopsis - ProteomicsDB",114,32188942,"MaxQuant score",147.0700000,0.9998850,,,,2.8135200409451E-6,
LIENDGTGAEQSR,ph,S,206,true,"Tissue atlas Arabidopsis - ProteomicsDB",114,32188942,"MaxQuant score",149.6000000,0.9999960,,,,6.5762799295044E-7,
MDDQMDVSPVSPWRPMR,ph,S,223,true,"TOR Kinase and ABA Receptor",100,29290610,XCorr,3.4674234,0.9996000,,,,0.00051199999870732,
MDDQMDVSPVSPWRPMR,ph,S,223,true,"Tissue atlas Arabidopsis - ProteomicsDB",114,32188942,"MaxQuant score",132.6700000,1.0000000,,,,1.2531999743493E-11,
MDDQMDVSPVSPWRPMR,ph,S,226,true,"Tissue atlas Arabidopsis - ProteomicsDB",114,32188942,"MaxQuant score",161.9900000,1.0000000,,,,2.1531000478009E-16,
GIVDGEGSDAASEGPHR,ph,S,292,true,"Tissue atlas Arabidopsis - ProteomicsDB",114,32188942,"MaxQuant score",122.8700000,1.0000000,,,,1.4346900334417E-9,
GIVDGEGSDAASEGPHR,ph,S,296,true,"Tissue atlas Arabidopsis - ProteomicsDB",114,32188942,"MaxQuant score",194.9400000,1.0000000,,,,3.2515799631116E-39,
NVMDLGSLELER,ph,S,370,true,"Tissue atlas Arabidopsis - ProteomicsDB",114,32188942,"MaxQuant score",161.7600000,1.0000000,,,,4.4891598771635E-10,
HNPFDVSYDSYDDMPIPGSAPSIMFAR,ph,S,438,true,"Arabidopsis root NAA phosphoproteome",18a,27643528,"MaxQuant Score",42.3010000,0.9270000,,,,0.00063409999711439,0.4240000
HNPFDVSYDSYDDMPIPGSAPSIMFAR,ph,S,438,true,"TOR Kinase and ABA Receptor",100,29290610,XCorr,5.1381650,1.0000000,,,,6.0749998738174E-6,
HNPFDVSYDSYDDMPIPGSAPSIMFAR,ph,S,438,true,"Tissue atlas Arabidopsis - ProteomicsDB",114,32188942,"MaxQuant score",107.3600000,0.9906430,,,,5.6717697971356E-28,
GDGFQEEFSSQQPK,ph,S,473,true,"Tissue atlas Arabidopsis - ProteomicsDB",114,32188942,"MaxQuant score",211.7500000,0.8155230,,,,7.623063645927E-43,
RHESFSVGPSMLGGPR,ph,S,487,true,"Large-scale phosphorylation discovery",44,23111157,XCorr,3.0960000,,,,,,
RHESFSVGPSMLGGPR,ph,S,487,true,"PAMP-triggered phosphorylation",48,24601666,"MASCOT Score",40.4300000,,,,,,
RHESFSVGPSMLGGPR,ph,S,487,true,"atm and atr DNA damage response",88,25561503,"MASCOT Score",72.0000000,0.9950000,,,,,0.3600000
RHESFSVGPSMLGGPR,ph,S,487,true,"TOR Kinase and ABA Receptor",100,29290610,XCorr,4.5562201,0.9159000,,,,2.5420000326903E-8,
HESFSVGPSMLGGPR,ph,S,487,true,"atm and atr DNA damage response",88,25561503,"MASCOT Score",36.0000000,1.0000000,,,,,-0.3600000
HESFSVGPSMLGGPR,ph,S,487,true,"Tissue atlas Arabidopsis - ProteomicsDB",114,32188942,"MaxQuant score",187.0400000,0.9999990,,,,3.587800102257E-26,
RHESFSVGPSMLGGPR,ph,S,489,true,"Tissue atlas Arabidopsis - ProteomicsDB",114,32188942,"MaxQuant score",114.0600000,0.9625590,,,,4.5277598559323E-8,
HESFSVGPSMLGGPR,ph,S,489,true,"TOR Kinase and ABA Receptor",100,29290610,XCorr,4.5135722,0.9325000,,,,6.2369997522183E-7,
QLSEVSESK,ph,S,527,true,"atm and atr DNA damage response",88,25561503,"MASCOT Score",48.0000000,0.9960000,,,,,0.0600000
QLSEVSESK,ph,S,527,true,"TOR Kinase and ABA Receptor",100,29290610,XCorr,2.0068955,0.9989000,,,,0.0031900000758469,
QLSEVSESK,ph,S,527,true,"Tissue atlas Arabidopsis - ProteomicsDB",114,32188942,"MaxQuant score",160.6100000,1.0000000,,,,0.00015428100596182,
QLSEVSESK,ph,S,530,true,"Tissue atlas Arabidopsis - ProteomicsDB",114,32188942,"MaxQuant score",130.3600000,0.9999990,,,,0.0007546300184913,
VSSIPDTESVCTVLEDDEK,ph,S,536,true,"Tissue atlas Arabidopsis - ProteomicsDB",114,32188942,"MaxQuant score",173.3700000,0.9982000,,,,1.8230100537185E-28,
VSSIPDTESVCTVLEDDEK,ph,S,542,true,"Tissue atlas Arabidopsis - ProteomicsDB",114,32188942,"MaxQuant score",127.9700000,0.9868050,,,,1.1992400040411E-14,
LDEVSDSDSSLSEKEEK,ph,S,654,true,"Tissue atlas Arabidopsis - ProteomicsDB",114,32188942,"MaxQuant score",105.8900000,0.9906460,,,,1.084300038201E-6,
AEESFITAHPSLDESAIHVLCGLGDGDHEEPVYDSSPPSGSR,ph,S,753,true,"Tissue atlas Arabidopsis - ProteomicsDB",114,32188942,"MaxQuant score",376.6000000,0.7857050,,,,0,
FPSFSSVSSDYKPDLPEK,ph,S,763,true,"TOR Kinase and ABA Receptor",100,29290610,XCorr,2.4651527,0.9089000,,,,0.019640000537038,
FPSFSSVSSDYKPDLPEK,ph,S,763,true,"Tissue atlas Arabidopsis - ProteomicsDB",114,32188942,"MaxQuant score",243.6100000,0.9998710,,,,0,
FPSFSSVSSDYKPDLPEK,ph,S,765,true,"Tissue atlas Arabidopsis - ProteomicsDB",114,32188942,"MaxQuant score",115.0100000,0.9290400,,,,2.0401300093731E-10,
EVYSESIGPEEIHSTSNETETR,ph,S,795,true,"Tissue atlas Arabidopsis - ProteomicsDB",114,32188942,"MaxQuant score",85.9740000,0.9899260,,,,2.5830999561549E-8,
EVYSESIGPEEIHSTSNETETR,ph,S,797,true,"Tissue atlas Arabidopsis - ProteomicsDB",114,32188942,"MaxQuant score",129.2400000,0.9976640,,,,2.5286599315481E-22,
TSEVGENSMHVTGEASLVMR,ph,S,821,true,"Tissue atlas Arabidopsis - ProteomicsDB",114,32188942,"MaxQuant score",86.0800000,0.9814050,,,,1.1816999858638E-6,
EHSTPLEESPDVVHDIAETSVNK,ph,S,836,true,"Tissue atlas Arabidopsis - ProteomicsDB",114,32188942,"MaxQuant score",68.4610000,0.9281120,,,,3.3384799280611E-6,
EHSTPLEESPDVVHDIAETSVNK,ph,T,837,true,"Tissue atlas Arabidopsis - ProteomicsDB",114,32188942,"MaxQuant score",202.4700000,0.9625060,,,,0,
EHSTPLEESPDVVHDIAETSVNK,ph,S,842,true,"Tissue atlas Arabidopsis - ProteomicsDB",114,32188942,"MaxQuant score",120.8300000,0.9998010,,,,3.4377200146597E-22,
SVVEQSSLEPGDDQVPTR,ph,S,976,true,"Tissue atlas Arabidopsis - ProteomicsDB",114,32188942,"MaxQuant score",167.1400000,0.9902090,,,,1.945850030395E-27,
AGPVSVVFSR,ph,S,992,true,"Tissue atlas Arabidopsis - ProteomicsDB",114,32188942,"MaxQuant score",112.4300000,0.9999950,,,,0.0002036509977188,
AGPVSVVFSR,ph,S,996,true,"atm and atr DNA damage response",88,25561503,"MASCOT Score",41.0000000,1.0000000,,,,,-0.3400000
AGPVSVVFSR,ph,S,996,true,"TOR Kinase and ABA Receptor",100,29290610,XCorr,3.6561685,1.0000000,,,,3.452999953879E-5,
AGPVSVVFSR,ph,S,996,true,"Tissue atlas Arabidopsis - ProteomicsDB",114,32188942,"MaxQuant score",147.3300000,0.9999970,,,,7.4808002636928E-7,
LEQLTDLHAISQSPPEIITEEADEIK,ph,S,1072,true,"TOR Kinase and ABA Receptor",100,29290610,XCorr,5.0828457,0.9930000,,,,2.1159999960219E-5,
QPKSPQSDSR,ph,S,1135,true,"atm and atr DNA damage response",88,25561503,"MASCOT Score",25.0000000,0.9560000,,,,,0.2600000
AETTEKEEEGEEEEESKPK,ph,T,1232,true,"Tissue atlas Arabidopsis - ProteomicsDB",114,32188942,"MaxQuant score",139.5100000,0.9923740,,,,6.9772200271881E-16,
EITKSDVLLVETR,ph,S,1252,true,"Tissue atlas Arabidopsis - ProteomicsDB",114,32188942,"MaxQuant score",166.9000000,0.9352580,,,,1.2729499969573E-14,
AAGPSNVTLSDEVVTEK,ph,S,1294,true,"Tissue atlas Arabidopsis - ProteomicsDB",114,32188942,"MaxQuant score",193.1900000,1.0000000,,,,4.1352205578348E-39,
AAGPSNVTLSDEVVTEK,ph,T,1297,true,"Tissue atlas Arabidopsis - ProteomicsDB",114,32188942,"MaxQuant score",67.4180000,0.9654700,,,,0.0016395299462602,
AAGPSNVTLSDEVVTEK,ph,S,1299,true,"Tissue atlas Arabidopsis - ProteomicsDB",114,32188942,"MaxQuant score",166.6000000,0.9999640,,,,5.5985501357568E-22,
AAGPSNVTLSDEVVTEK,ph,T,1304,true,"Tissue atlas Arabidopsis - ProteomicsDB",114,32188942,"MaxQuant score",57.1710000,0.8742700,,,,0.0042520500719547,
AKAETTASNTDANVQSPESK,ph,S,1322,true,"Tissue atlas Arabidopsis - ProteomicsDB",114,32188942,"MaxQuant score",403.4900000,0.9999990,,,,0,
AETTASNTDANVQSPESK,ph,S,1322,true,"atm and atr DNA damage response",88,25561503,"MASCOT Score",42.0000000,0.9290000,,,,,0.2900000
AETTASNTDANVQSPESK,ph,S,1322,true,"TOR Kinase and ABA Receptor",100,29290610,XCorr,5.4641466,0.9840000,,,,7.6309997893986E-6,
AETTASNTDANVQSPESK,ph,S,1322,true,"Lateral root-induction - NAA vs control",106,23328941,"MASCOT Score",59.0000000,,,,,,
ETPENSVETIAEQK,ph,T,1328,true,"Tissue atlas Arabidopsis - ProteomicsDB",114,32188942,"MaxQuant score",150.8100000,1.0000000,,,,6.0370001619958E-7,
ETPENSVETIAEQK,ph,T,1335,true,"Tissue atlas Arabidopsis - ProteomicsDB",114,32188942,"MaxQuant score",76.8200000,0.9929390,,,,0.001730759977363,
