Peptide,PTM,ModifiedAA,ModifiedPosition,PeptideUniqueToGene,ExperimentDesc,ExpID,PubmedID,ScoreType,IdentScore,LocProb,Log2FChange,PQ-val,QuantSig,PEP,MassErrorPPM
MDTEFLRTLD,nta,M,1,true,"N-term acetylation drought responses",5,26184543,,,,,,,,
MDTEFLR,nta,M,1,true,"Arg/N-end rule seed, prt6 vs. Wt",99,29168982,"MASCOT Score",50.6400000,,,,,0.18600000441074,-0.3856004
MDTEFLR,nta,M,1,true,"Arabidopsis translation initiation landscape - NTA",167a,35069635,,,,,,,,
VCLDPENFK,acy,C,41,true,"Arabidopsis S-acylation atlas - Meristem",163a,35681017,,,,,,,,
VCLDPENFK,ox,C,41,true,"SPEAR - 50 mM H2O2 / mock",138b,34619326,,,,1.6073559,0.0423645,YES,,
VCLDPENFK,sno,C,41,true,"hot5-4 / wildtype, FAT-switch S-nitrosoproteome",169,37277371,,,,0.3942759,0.0010358,NO,,
RVCLDPENFK,so,C,41,true,"Arabidopsis S-sulfenylation chemoproteomics",108,31578252,"pFind PSM Score",0.2574620,,0.8849600,,,,-0.6126661
VGDHLAVKGPKGR,ub,K,143,true,"Ubiquitination Membrane Proteins",120,33585938,,,,,,,,
AILENPTDKTK,ub,K,182,true,"upl3 mutant / wildtype",168,35926874,"MaxQuant score",133.8900000,1.0000000,0.0028825,0.9948800,NO,2.0211100348888E-8,0.1091900
EMIQTHCPAPASDIQILR,acy,C,243,true,"Arabidopsis S-acylation atlas - Silique",163e,35681017,,,,,,,,
EMIQTHCPAPASDIQILR,so,C,243,true,"Arabidopsis S-sulfenylation chemoproteomics",108,31578252,"pFind PSM Score",0.1201780,,1.4084500,,,,-0.6154074
