Peptide,PTM,ModifiedAA,ModifiedPosition,PeptideUniqueToGene,ExperimentDesc,ExpID,PubmedID,ScoreType,IdentScore,LocProb,Log2FChange,PQ-val,QuantSig,PEP,MassErrorPPM
KKPQVLNEAGEAETAVETVGESR,ph,S,31,true,"Tissue atlas Arabidopsis - ProteomicsDB",114,32188942,"MaxQuant score",200.7900000,0.9998490,,,,0,
KISGDGGFGSDDGGGGGGGGSGESILR,ub,K,33,true,"Arabidopsis ubiquitination COFRADIC",40,26744219,"MaxQuant Score",243.9400000,1.0000000,,,,0,-0.7230000
KISGDGGFGSDDGGGGGGGGSGESILR,ph,S,35,true,"STN8 phosphoproteome",38,21768351,"MASCOT Score",74.0900000,,,,,,
KISGDGGFGSDDGGGGGGGGSGESILR,ph,S,35,true,"srk2dei ABA signaling phopshoproteomics",83,23572148,"MASCOT Score",56.0000000,,,,,,0.0009000
KISGDGGFGSDDGGGGGGGGSGESILR,ph,S,35,true,"LAXIC - mannitol vs control",84b,23660473,XCorr,6.1200000,1.0000000,1.2701659,,NO,1.1300000046788E-8,
KISGDGGFGSDDGGGGGGGGSGESILR,ph,S,35,true,"TOR Kinase and ABA Receptor",100,29290610,XCorr,5.3104858,1.0000000,,,,5.7810001408143E-7,
KISGDGGFGSDDGGGGGGGGSGESILR,ph,S,35,true,"Phospho cell culture sucrose/TOR",109,30833711,,,1.0000000,,,,,
KISGDGGFGSDDGGGGGGGGSGESILR,ph,S,35,true,"Col-0 callus - FC Col-0 vs. Col-0 Xray",111a,31410901,,69.7700000,,0.3282025,0.0000000,NO,,1.0001386
KISGDGGFGSDDGGGGGGGGSGESILR,ph,S,35,true,"Col-0 X-ray callus - FC Col-0 vs. Col-0 Xray",111b,31410901,,69.7700000,,0.3282025,0.0000000,NO,,1.0001386
KISGDGGFGSDDGGGGGGGGSGESILR,ph,S,35,true,"atm callus - FC atm vs. atm Xray",111c,31410901,,69.7700000,,0.5889221,0.0000000,NO,,1.0001386
KISGDGGFGSDDGGGGGGGGSGESILR,ph,S,35,true,"atm-3 X-ray callus - FC atm vs. atm Xray",111d,31410901,,69.7700000,,0.5889221,0.0000000,NO,,1.0001386
KISGDGGFGSDDGGGGGGGGSGESILR,ph,S,35,true,"Tissue atlas Arabidopsis - ProteomicsDB",114,32188942,"MaxQuant score",327.2700000,1.0000000,,,,0,
KISGDGGFGSDDGGGGGGGGSGESILR,ph,S,35,true,"Touch-induced phosphorylation: 40s touch vs untouc",136,30291188,"MASCOT score",138.8600000,,-0.0104452,0.9922014,NO,,-2.1830734
KISGDGGFGSDDGGGGGGGGSGESILR,ph,S,42,true,"Conserved plant phosphoproteome - Arabidopsis",61a,20466843,"MASCOT Score",62.0000000,1.0000000,,,,,
KISGDGGFGSDDGGGGGGGGSGESILR,ph,S,42,true,"srk2dei ABA signaling phopshoproteomics",83,23572148,"MASCOT Score",56.0000000,,,,,,0.0009000
KISGDGGFGSDDGGGGGGGGSGESILR,ph,S,42,true,"LAXIC - mannitol vs control",84b,23660473,XCorr,6.1200000,1.0000000,1.2701659,,NO,1.1300000046788E-8,
KISGDGGFGSDDGGGGGGGGSGESILR,ph,S,42,true,"TOR Kinase and ABA Receptor",100,29290610,XCorr,5.3104858,1.0000000,,,,5.7810001408143E-7,
KISGDGGFGSDDGGGGGGGGSGESILR,ph,S,42,true,"Col-0 callus - FC Col-0 vs. Col-0 Xray",111a,31410901,,74.0000000,,0.3377813,0.0000000,NO,,0.6674221
KISGDGGFGSDDGGGGGGGGSGESILR,ph,S,42,true,"Col-0 X-ray callus - FC Col-0 vs. Col-0 Xray",111b,31410901,,74.0000000,,0.3377813,0.0000000,NO,,0.6674221
KISGDGGFGSDDGGGGGGGGSGESILR,ph,S,42,true,"atm callus - FC atm vs. atm Xray",111c,31410901,,74.0000000,,0.6079745,0.0000000,NO,,0.6674221
KISGDGGFGSDDGGGGGGGGSGESILR,ph,S,42,true,"atm-3 X-ray callus - FC atm vs. atm Xray",111d,31410901,,74.0000000,,0.6079745,0.0000000,NO,,0.6674221
KISGDGGFGSDDGGGGGGGGSGESILR,ph,S,42,true,"Tissue atlas Arabidopsis - ProteomicsDB",114,32188942,"MaxQuant score",429.9500000,1.0000000,,,,0,
KISGDGGFGSDDGGGGGGGGSGESILR,ph,S,42,true,"Touch-induced phosphorylation: 40s touch vs untouc",136,30291188,"MASCOT score",138.8600000,,-0.0104452,0.9922014,NO,,-2.1830734
ISGDGGFGSDDGGGGGGGGSGESILR,ph,S,42,true,"TOR Kinase and ABA Receptor",100,29290610,XCorr,4.4450717,0.9992000,,,,1.61699997836E-9,
ISGDGGFGSDDGGGGGGGGSGESILR,ph,S,42,true,"Col-0 callus - FC Col-0 vs. Col-0 Xray",111a,31410901,,101.3500000,,1.6419666,0.0000000,NO,,0.7527085
ISGDGGFGSDDGGGGGGGGSGESILR,ph,S,42,true,"Col-0 X-ray callus - FC Col-0 vs. Col-0 Xray",111b,31410901,,101.3500000,,1.6419666,0.0000000,NO,,0.7527085
ISGDGGFGSDDGGGGGGGGSGESILR,ph,S,42,true,"atm callus - FC atm vs. atm Xray",111c,31410901,,101.3500000,,-1.1336663,0.0000000,NO,,0.7527085
ISGDGGFGSDDGGGGGGGGSGESILR,ph,S,42,true,"atm-3 X-ray callus - FC atm vs. atm Xray",111d,31410901,,101.3500000,,-1.1336663,0.0000000,NO,,0.7527085
ISGDGGFGSDDGGGGGGGGSGESILR,ph,S,53,true,"Tissue atlas Arabidopsis - ProteomicsDB",114,32188942,"MaxQuant score",203.0600000,0.9811880,,,,0,
LTSTSHDATEK,ph,S,189,true,"Tissue atlas Arabidopsis - ProteomicsDB",114,32188942,"MaxQuant score",113.5200000,0.7682760,,,,3.0999399314169E-5,
NAYVSNQVEANSGSVGMAR,ph,S,241,true,"atm and atr DNA damage response",88,25561503,"MASCOT Score",45.0000000,1.0000000,,,,,-0.2200000
NAYVSNQVEANSGSVGMAR,ph,S,241,true,"Tissue atlas Arabidopsis - ProteomicsDB",114,32188942,"MaxQuant score",40.5520000,0.8518990,,,,0.015985300764441,
NAYVSNQVEANSGSVGMAR,ph,S,243,true,"atm and atr DNA damage response",88,25561503,"MASCOT Score",45.0000000,1.0000000,,,,,-0.2200000
LIDNEKEYDPTLNELR,ub,K,257,true,"Arabidopsis ubiquitination COFRADIC",40,26744219,"MaxQuant Score",89.3580000,1.0000000,,,,1.7579999955775E-12,1.6640000
GPVNNSNGAGCSQGGGIGSEGDNVRPNGLLK,ph,S,279,true,"Tissue atlas Arabidopsis - ProteomicsDB",114,32188942,"MaxQuant score",198.4900000,0.9999070,,,,0,
GPVNNSNGAGCSQGGGIGSEGDNVRPNGLLK,ph,S,286,true,"Tissue atlas Arabidopsis - ProteomicsDB",114,32188942,"MaxQuant score",187.1100000,0.9999990,,,,0,
FKQDGSTSNNHTAPTDQNLTPDLTTLDSFGR,ph,S,351,true,"Tissue atlas Arabidopsis - ProteomicsDB",114,32188942,"MaxQuant score",161.3000000,0.9990320,,,,0,
MGNEYPGVMENCNLSQK,so,C,369,true,"S-sulfenylation site detection using YAP1C",110,32714340,,,,,,,,
MGNEYPGVMENCNLSQKTK,ph,S,372,true,"srk2dei ABA signaling phopshoproteomics",83,23572148,"MASCOT Score",28.0000000,,,,,,0.0043000
MGNEYPGVMENCNLSQKTK,ph,T,375,true,"srk2dei ABA signaling phopshoproteomics",83,23572148,"MASCOT Score",28.0000000,,,,,,0.0043000
SDGKEALVDNR,ub,K,414,true,"Arabidopsis ubiquitination COFRADIC",40,26744219,"MaxQuant Score",77.0620000,1.0000000,,,,0.0010000000474975,0.5220000
