Peptide,PTM,ModifiedAA,ModifiedPosition,PeptideUniqueToGene,ExperimentDesc,ExpID,PubmedID,ScoreType,IdentScore,LocProb,Log2FChange,PQ-val,QuantSig,PEP,MassErrorPPM
MAFNLNSSMRAHTLSK,ph,T,24,false,"Brassinosteroid-Regulated Phosphorylation Dynamics",94,26187819,"MaxQuant Score",79.8750000,1.0000000,,,,0.037000000476837,-0.1680000
MAFNLNSSMRAHTLSK,ph,S,26,false,"Brassinosteroid-Regulated Phosphorylation Dynamics",94,26187819,"MaxQuant Score",79.8750000,1.0000000,,,,0.037000000476837,-0.1680000
CNATSSSATVPSLDKNDFLKLQNGSDIR,nta,C,40,true,"Arabidopsis translation initiation landscape - NTA",167a,35069635,,,,,,,,
TSSSATVPSLDKNDFLKLQNGSDIR,nt,T,43,true,"Stromal N-terminome",96,26371235,"MASCOT Score",48.9600000,,,,,,
TSSSATVPSLDKNDFLKLQNGSDIR,nta,T,43,true,"Stromal N-terminome",96,26371235,"MASCOT Score",48.9600000,,,,,,
FFTSDGGLGKVDIK,ac,K,193,true,"Quantitative Acetylproteomics",101,29440448,,,,,,,,
VDIKNILER,ac,K,197,true,"Histone deacetylases substrates - hda14 vs WT",98e,29061669,"MaxQuant Score",40.5000000,1.0000000,-0.0070000,0.9931160,NO,0.029999999329448,
VDIKNILER,ac,K,197,true,"Quantitative Acetylproteomics",101,29440448,,,,,,,,
AAMEAITK,mox,M,307,true,"cat2 Methionine oxidation - 1h stress",62a,25693801,"MASCOT Score",41.0000000,,0.3758523,,NO,,
AAMEAITK,mox,M,307,true,"cat2 Methionine oxidation - 3h stress",62b,25693801,"MASCOT Score",42.0000000,,-0.3182413,,NO,,
GYKNVIDEAIR,ac,K,394,true,"Quantitative Acetylproteomics",101,29440448,,,,,,,,
EFNALDTCALSNLTHSS,sno,C,572,true,"hot5-4 / wildtype, FAT-switch S-nitrosoproteome",169,37277371,,,,0.1924533,0.1348178,NO,,
EFNALDTCALSNLTHSS,so,C,572,true,"S-sulfenylation site detection using YAP1C",110,32714340,,,,,,,,
