Peptide,PTM,ModifiedAA,ModifiedPosition,PeptideUniqueToGene,ExperimentDesc,ExpID,PubmedID,ScoreType,IdentScore,LocProb,Log2FChange,PQ-val,QuantSig,PEP,MassErrorPPM
LHSSASLLSQK,ph,S,32,true,"Tissue atlas Arabidopsis - ProteomicsDB",114,32188942,"MaxQuant score",106.2600000,0.8094290,,,,4.150639870204E-5,
LHSSASLLSQK,ph,S,34,true,"Tissue atlas Arabidopsis - ProteomicsDB",114,32188942,"MaxQuant score",210.6100000,0.9808580,,,,5.9468698422442E-25,
RAAASKTIE,nta,R,79,true,"Arabidopsis translation initiation landscape - NTA",167a,35069635,,,,,,,,
AAASKTIEVEVDKPLGLTLGQK,ph,T,85,true,"MAPK Arabidopsis substrates",45,23172892,"MaxQuant Score",134.8700000,,,,,,
AAASKTIEVEVDKPLGLTLGQK,ph,T,85,true,"TOR Kinase and ABA Receptor",100,29290610,XCorr,3.7661548,0.9861000,,,,5.4650001857226E-7,
TIEVEVDKPLGLTLGQK,ph,T,85,true,"Large-scale phosphorylation discovery",44,23111157,XCorr,4.3340000,,,,,,
TIEVEVDKPLGLTLGQK,ph,T,85,true,"TOR Kinase and ABA Receptor",100,29290610,XCorr,2.5272930,1.0000000,,,,0.012480000033975,
TIEVEVDKPLGLTLGQK,ph,T,85,true,"Tissue atlas Arabidopsis - ProteomicsDB",114,32188942,"MaxQuant score",202.9100000,1.0000000,,,,0,
TIEVEVDKPLGLTLGQK,ac,K,92,true,"Histone deacetylases - hda14 vs WT (thylakoids)",98d,29061669,"MaxQuant Score",57.5000000,1.0000000,0.0120000,0.9977001,NO,7.029999687802E-5,
TIEVEVDKPLGLTLGQK,ph,T,97,true,"Tissue atlas Arabidopsis - ProteomicsDB",114,32188942,"MaxQuant score",98.2690000,1.0000000,,,,2.163460067095E-6,
LGFTKTAIQAK,ac,K,149,true,"Histone deacetylases - hda14 vs WT (thylakoids)",98d,29061669,"MaxQuant Score",78.9000000,1.0000000,3.1450000,0.0895365,NO,0.003000000026077,
KLTETQKAR,ph,T,188,true,"Chloroplast kinase substrates",60,19376835,"MASCOT Score",32.9600000,,,,,,0.5128220
KLTETQKAR,ac,K,192,true,"Quantitative Acetylproteomics",101,29440448,,,,,,,,
LTETQKAR,ac,K,192,true,"Quantitative Acetylproteomics",101,29440448,,,,,,,,
SFDEQPDTYVCPQCIAPK,acy,C,224,true,"Arabidopsis S-acylation atlas - Leaf",163c,35681017,,,,,,,,
FAKYDVNTGK,ac,K,233,true,"Histone deacetylases - apicidin vs control",98a,29061669,"MaxQuant Score",117.8000000,1.0000000,0.0960000,0.5780960,NO,1.6999999630229E-8,
FAKYDVNTGK,ac,K,233,true,"Histone deacetylases - hda14 vs WT (thylakoids)",98d,29061669,"MaxQuant Score",91.3000000,1.0000000,0.3320000,0.8375293,NO,0.0070000002160668,
FAKYDVNTGK,ac,K,233,true,"Histone deacetylases substrates - hda14 vs WT",98e,29061669,"MaxQuant Score",60.3000000,1.0000000,0.3800000,0.5345644,NO,0.0040000001899898,
