Peptide,PTM,ModifiedAA,ModifiedPosition,PeptideUniqueToGene,ExperimentDesc,ExpID,PubmedID,ScoreType,IdentScore,LocProb,Log2FChange,PQ-val,QuantSig,PEP,MassErrorPPM
AAEKLRDLSQPIDVGVLDATVAAF,nta,A,2,true,"Arabidopsis translation initiation landscape - NTA",167a,35069635,,,,,,,,
TSETICENCMAILK,sno,C,155,false,"hot5-4 / wildtype, FAT-switch S-nitrosoproteome",169,37277371,,,,,,,,
DLLNLCEITK,sno,C,531,true,"hot5-4 / wildtype, FAT-switch S-nitrosoproteome",169,37277371,,,,0.2127941,0.2682347,NO,,
DLLNLCEITK,so,C,531,true,"S-sulfenylation site detection using YAP1C",110,32714340,,,,,,,,
FLVMVIRDLLNLCEITK,ph,T,534,true,"Phosphorylation in N starvation",63,22060019,"MASCOT Score",20.0000000,,,,,,9.5428800
LFEFMHETHPGVQDMACDTFLK,sno,C,588,false,"hot5-4 / wildtype, FAT-switch S-nitrosoproteome",169,37277371,,,,,,,,
NFQQSEFCNQFYR,so,C,913,true,"Arabidopsis S-sulfenylation chemoproteomics",108,31578252,"pFind PSM Score",0.0003717,,1.6024000,,,,-1.3063323
NDPSGFKNNIR,ac,K,1019,true,"Quantitative Acetylproteomics",101,29440448,,,,,,,,
NDPSGFKNNIR,ub,K,1019,true,"Arabidopsis ubiquitination COFRADIC",40,26744219,"MaxQuant Score",53.2370000,1.0000000,,,,0.0010000000474975,0.3970000
