Peptide,PTM,ModifiedAA,ModifiedPosition,PeptideUniqueToGene,ExperimentDesc,ExpID,PubmedID,ScoreType,IdentScore,LocProb,Log2FChange,PQ-val,QuantSig,PEP,MassErrorPPM
GDNLMDKVTAFGER,nt,G,2,true,"Stromal N-terminome",96,26371235,"MASCOT Score",55.4100000,,,,,,
GDNLMDKVTAFGER,nt,G,2,true,"Arg/N-end rule seed, prt6 vs. Wt",99,29168982,"MASCOT Score",49.0700000,,,,,0.00099820003379136,-1.5092239
GDNLMDKVTAFGE,nt,G,2,true,"Arg/N-end rule seed, prt6 vs. Wt",99,29168982,"MASCOT Score",36.5400000,,,,,2.5330000426038E-5,-3.3724545
GDNLMDKVTA,nt,G,2,true,"N-term acetylation drought responses",5,26184543,,,,,,,,
GDNLMDKVTAFGER,nta,G,2,true,"Arg/N-end rule pathway Roots",80,25728785,"MASCOT Score",58.8600000,,,,,3.8079999740148E-6,
GDNLMDKVTAFGER,nta,G,2,true,"Stromal N-terminome",96,26371235,"MASCOT Score",55.4100000,,,,,,
GDNLMDKVTAFGER,nta,G,2,true,"Arg/N-end rule seed, prt6 vs. Wt",99,29168982,"MASCOT Score",49.0700000,,-0.1601540,0.1950048,NO,0.00099820003379136,-1.5092239
GDNLMDKVTAFGER,nta,G,2,true,"FtsH12 N-terminome: WT / FtsH12 knockdown miRNA",118,33216923,"MaxQuant score",120.6200000,,,,,0.0020494998898357,
GDNLMDKVTAFGER,nta,G,2,true,"HUNTER N-terminome: legumain, GluC and trypsin",119,31951383,"MaxQuant score",41.0520000,,,,,,
GDNLMDKVTAFGER,nta,G,2,true,"Arabidopsis translation initiation landscape - NTA",167a,35069635,,,,,,,,
GDNLMDKVTAFGE,nta,G,2,true,"Arg/N-end rule seed, prt6 vs. Wt",99,29168982,"MASCOT Score",36.5400000,,-0.3099208,0.4871111,NO,2.5330000426038E-5,-3.3724545
GDNLMDKVTAFGE,nta,G,2,true,"HUNTER N-terminome: legumain, GluC and trypsin",119,31951383,"MaxQuant score",,,,,,,
GDNLMDKVTA,nta,G,2,true,"N-term acetylation drought responses",5,26184543,,,,,,,,
GDNLMDK,nta,G,2,true,"Characterization plant N-terminal acetylation",6,22223895,"MASCOT Score",42.1100000,,,,,,
GDNLMDKVTAFGER,ub,K,8,true,"upl3 mutant / wildtype",168,35926874,"MaxQuant score",145.9200000,1.0000000,-0.3327891,,,1.6855400755689E-11,-0.5878000
LKIGGSEVSNK,ub,K,17,true,"Ubiquitination Membrane Proteins",120,33585938,,,,,,,,
LKIGGSEVSNK,ub,K,17,true,"upl3 mutant / wildtype",168,35926874,"MaxQuant score",92.2470000,1.0000000,-0.6803821,0.2085200,NO,0.00041572499321774,0.4706000
IGGSEVSNKISAGVSSMSFK,ub,K,26,true,"Ubiquitination Membrane Proteins",120,33585938,,,,,,,,
IGGSEVSNKISAGVSSMSFK,ub,K,26,true,"upl3 mutant / wildtype",168,35926874,"MaxQuant score",59.8570000,1.0000000,0.3606452,,,8.3931998233311E-5,0.2041700
ISAGVSSMSFK,ph,S,32,true,"MAPK Arabidopsis substrates",45,23172892,"MaxQuant Score",64.1210000,,,,,,
ISAGVSSMSFK,ph,S,32,true,"srk2dei ABA signaling phopshoproteomics",83,23572148,"MASCOT Score",43.0000000,,,,,,-0.0003000
ISAGVSSMSFK,ph,S,32,true,"Tissue atlas Arabidopsis - ProteomicsDB",114,32188942,"MaxQuant score",97.4630000,0.9051410,,,,0.00027920200955123,
ISAGVSSMSFKVK,ph,S,33,true,"MAPK Arabidopsis substrates",45,23172892,"MaxQuant Score",131.6900000,,,,,,
ISAGVSSMSFK,ph,S,33,true,"Phosphoproteome iron-deficient Arabidopsis roots",41,22438062,"MASCOT Score",47.6600000,,,,,,
ISAGVSSMSFK,ph,S,33,true,"BSK8 and BSL2 regulating sucrose-ph synthase",66,24924143,"MaxQuant Score",144.8000000,,,,,,1.6782000
ISAGVSSMSFK,ph,S,33,true,"srk2dei ABA signaling phopshoproteomics",83,23572148,"MASCOT Score",45.0000000,,,,,,-0.0007000
ISAGVSSMSFK,ph,S,33,true,"SIRK1 exp - sirk1 mutant vs WT",86b,23820729,,,,0.4275601,,NO,,
ISAGVSSMSFK,ph,S,33,true,"SIRK1 exp - 35S:SIRK1 vs WT",86c,23820729,,,,0.8891118,,NO,,
ISAGVSSMSFK,ph,S,33,true,"Lateral root-induction - NAA vs control",106,23328941,"MASCOT Score",25.0000000,,,,,,
ISAGVSSMSFKVK,ph,S,35,true,"MAPK Arabidopsis substrates",45,23172892,"MaxQuant Score",133.1500000,,,,,,
ISAGVSSMSFKVK,ph,S,35,true,"PAMP-triggered phosphorylation",48,24601666,"MASCOT Score",70.0100000,,,,,,
ISAGVSSMSFKVK,ph,S,35,true,"atm and atr DNA damage response",88,25561503,"MASCOT Score",42.0000000,1.0000000,,,,,-0.1100000
ISAGVSSMSFK,ph,S,35,true,"Arabidopsis root NAA phosphoproteome",18a,27643528,"MaxQuant Score",74.9930000,0.9250000,,,,2.413999879991E-7,-0.0130000
ISAGVSSMSFK,ph,S,35,true,"Phosphoproteome iron-deficient Arabidopsis roots",41,22438062,"MASCOT Score",90.2800000,,,,,,
ISAGVSSMSFK,ph,S,35,true,"PAMP-triggered phosphorylation",48,24601666,"MASCOT Score",47.7700000,,,,,,
ISAGVSSMSFK,ph,S,35,true,"BSK8 and BSL2 regulating sucrose-ph synthase",66,24924143,"MaxQuant Score",144.8000000,,,,,,2.4745000
ISAGVSSMSFK,ph,S,35,true,"srk2dei ABA signaling phopshoproteomics",83,23572148,"MASCOT Score",69.0000000,,,,,,-0.0002000
ISAGVSSMSFK,ph,S,35,true,"SnRK2 protein kinase substrates",85,23776212,XCorr,2.8003774,0.9970000,,,,0.00086229597218335,
ISAGVSSMSFK,ph,S,35,true,"atm and atr DNA damage response",88,25561503,"MASCOT Score",63.0000000,1.0000000,,,,,-0.9200000
ISAGVSSMSFK,ph,S,35,true,"Protein sumoylation and phosphorylation cross-talk",97,28419593,,,,,,,,
ISAGVSSMSFK,ph,S,35,true,"TOR Kinase and ABA Receptor",100,29290610,XCorr,3.5501792,0.9934000,,,,7.7260003308766E-5,
ISAGVSSMSFK,ph,S,35,true,"Phospho cell culture sucrose/TOR",109,30833711,,,0.9961520,,,,,
ISAGVSSMSFK,ph,S,35,true,"Col-0 callus - FC Col-0 vs. Col-0 Xray",111a,31410901,,53.3300000,,1.7161976,0.0000000,NO,,0.1626745
ISAGVSSMSFK,ph,S,35,true,"Col-0 X-ray callus - FC Col-0 vs. Col-0 Xray",111b,31410901,,53.3300000,,1.7161976,0.0000000,NO,,0.1626745
ISAGVSSMSFK,ph,S,35,true,"atm callus - FC atm vs. atm Xray",111c,31410901,,53.3300000,,0.0774296,0.0000000,NO,,0.1626745
ISAGVSSMSFK,ph,S,35,true,"atm-3 X-ray callus - FC atm vs. atm Xray",111d,31410901,,53.3300000,,0.0774296,0.0000000,NO,,0.1626745
ISAGVSSMSFK,ph,S,35,true,"Tissue atlas Arabidopsis - ProteomicsDB",114,32188942,"MaxQuant score",194.0100000,0.9999380,,,,4.0220601860278E-30,
ISAGVSSMSFKVK,ub,K,37,true,"Ubiquitination Membrane Proteins",120,33585938,,,,,,,,
ISAGVSSMSFKVK,ub,K,37,true,"upl3 mutant / wildtype",168,35926874,"MaxQuant score",113.0700000,1.0000000,-1.2276920,0.3258000,NO,1.9493700165185E-5,-0.4513100
VKELFQGPNPTDK,ub,K,39,true,"upl3 mutant / wildtype",168,35926874,"MaxQuant score",139.3000000,1.0000000,0.0881416,0.7727800,NO,2.8086399872507E-9,-1.2184000
NCEKAFSEVAAER,ub,K,117,true,"upl3 mutant / wildtype",168,35926874,"MaxQuant score",108.5800000,1.0000000,-0.1440103,0.7544400,NO,1.9767499907175E-5,-0.3767900
YLPVFEETYKSLK,ub,K,173,true,"upl3 mutant / wildtype",168,35926874,"MaxQuant score",84.3650000,1.0000000,0.3482324,,,3.0839099053992E-5,1.3946000
DNESLAPIFTPAR,ph,T,195,true,"Tissue atlas Arabidopsis - ProteomicsDB",114,32188942,"MaxQuant score",224.3400000,1.0000000,,,,0,
STPAPELNADLPQHVHEPAHIQYDVPVR,ph,T,200,true,"Tissue atlas Arabidopsis - ProteomicsDB",114,32188942,"MaxQuant score",167.7400000,0.8641680,,,,0,
SFTAEQTKEAFDIAR,ub,K,234,true,"upl3 mutant / wildtype",168,35926874,"MaxQuant score",124.6200000,1.0000000,-0.4961425,,,1.9935200157306E-8,2.8025000
TLSKYEEMNKPSAPLTSHEPAMIPVAEEPDDSPIHGREESLVR,ph,S,337,true,"PAMP-triggered phosphorylation",48,24601666,"MASCOT Score",42.3600000,,,,,,
YEEMNKPSAPLTSHEPAMIPVAEEPDDSPIHGREESLVR,ph,S,337,true,"PAMP-triggered phosphorylation",48,24601666,"MASCOT Score",66.4500000,,,,,,
TLSKYEEMNKPSAPLTSHEPAMIPVAEEPDDSPIHGR,ph,S,337,true,"PAMP-triggered phosphorylation",48,24601666,"MASCOT Score",39.5600000,,,,,,
YEEMNKPSAPLTSHEPAMIPVAEEPDDSPIHGR,ph,S,337,true,"Arabidopsis root NAA phosphoproteome",18a,27643528,"MaxQuant Score",106.8100000,1.0000000,,,,7.3040001559523E-19,-0.0560000
YEEMNKPSAPLTSHEPAMIPVAEEPDDSPIHGR,ph,S,337,true,"Phosphorylation Early Elicitor Signaling",23,17317660,,,,,,,,
YEEMNKPSAPLTSHEPAMIPVAEEPDDSPIHGR,ph,S,337,true,"PAMP-triggered phosphorylation",48,24601666,"MASCOT Score",58.2300000,,,,,,
YEEMNKPSAPLTSHEPAMIPVAEEPDDSPIHGR,ph,S,337,true,"Chloroplast kinase substrates",60,19376835,"MASCOT Score",74.9300000,,,,,,-0.6041590
YEEMNKPSAPLTSHEPAMIPVAEEPDDSPIHGR,ph,S,337,true,"LAXIC - mannitol vs control",84b,23660473,XCorr,4.6100000,0.9860000,-1.3768512,,NO,5.0399999054207E-6,
YEEMNKPSAPLTSHEPAMIPVAEEPDDSPIHGR,ph,S,337,true,"SnRK2 protein kinase substrates",85,23776212,XCorr,5.7716417,1.0000000,,,,5.7460199792692E-13,
YEEMNKPSAPLTSHEPAMIPVAEEPDDSPIHGR,ph,S,337,true,"TOR Kinase and ABA Receptor",100,29290610,XCorr,5.1907558,1.0000000,,,,1.8750000890577E-5,
YEEMNKPSAPLTSHEPAMIPVAEEPDDSPIHGR,ph,S,337,true,"Lateral root-induction - NAA vs control",106,23328941,"MASCOT Score",41.0000000,,,,,,
YEEMNKPSAPLTSHEPAMIPVAEEPDDSPIHGR,ph,S,337,true,"Phospho cell culture sucrose/TOR",109,30833711,,,1.0000000,,,,,
YEEMNKPSAPLTSHEPAMIPVAEEPDDSPIHGR,ph,S,337,true,"Tissue atlas Arabidopsis - ProteomicsDB",114,32188942,"MaxQuant score",294.1200000,1.0000000,,,,0,
EESLVRK,ph,S,345,false,"Tissue atlas Arabidopsis - ProteomicsDB",114,32188942,"MaxQuant score",100.0200000,1.0000000,,,,0.016049299389124,
GGFHGGGGSGDDMMDDLDEMIFGKK,ph,S,363,true,"MAPK Arabidopsis substrates",45,23172892,"MaxQuant Score",76.1980000,,,,,,
GGFHGGGGSGDDMMDDLDEMIFGKK,ph,S,363,true,"SnRK2 protein kinase substrates",85,23776212,XCorr,4.6685143,1.0000000,,,,0.00033611399703659,
GGFHGGGGSGDDMMDDLDEMIFGK,ph,S,363,true,"Large-scale phosphorylation discovery",44,23111157,XCorr,4.7100000,,,,,,
GGFHGGGGSGDDMMDDLDEMIFGK,ph,S,363,true,"srk2dei ABA signaling phopshoproteomics",83,23572148,"MASCOT Score",61.0000000,,,,,,0.0020000
GGFHGGGGSGDDMMDDLDEMIFGK,ph,S,363,true,"SnRK2 protein kinase substrates",85,23776212,XCorr,5.0976501,1.0000000,,,,1.9343600499155E-8,
GGFHGGGGSGDDMMDDLDEMIFGK,ph,S,363,true,"TOR Kinase and ABA Receptor",100,29290610,XCorr,5.3063478,1.0000000,,,,7.8700004451093E-6,
NGCDSSTNPDHDPK,sno,C,382,true,"Site-specific nitrosomeproteomic id - gsnor1-3",90b,25699590,XCorr,2.2200000,,,,,0.15289999544621,-6.4000000
EQSSSKNDDLIRF,ph,S,397,true,"Tissue atlas Arabidopsis - ProteomicsDB",114,32188942,"MaxQuant score",87.9320000,0.8448480,,,,0.00015717299538665,
EQSSSKNDDLIRF,ph,S,399,true,"Tissue atlas Arabidopsis - ProteomicsDB",114,32188942,"MaxQuant score",76.1510000,0.7815110,,,,0.00046942601329647,
EQSSSKNDDLIRF,ub,K,400,true,"upl3 mutant / wildtype",168,35926874,"MaxQuant score",80.9600000,1.0000000,1.2159892,0.1768030,NO,0.0014604299794883,-0.1413400
