Peptide,PTM,ModifiedAA,ModifiedPosition,PeptideUniqueToGene,ExperimentDesc,ExpID,PubmedID,ScoreType,IdentScore,LocProb,Log2FChange,PQ-val,QuantSig,PEP,MassErrorPPM
SFQDLEAGTR,nt,S,2,true,"Arg/N-end rule seed, prt6 vs. Wt",99,29168982,"MASCOT Score",62.3000000,,,,,0.087279997766018,-0.9930874
SFQDLEAGTRSPAPN,nta,S,2,true,"HUNTER N-terminome: legumain, GluC and trypsin",119,31951383,"MaxQuant score",99.5310000,,,,,,
SFQDLEAGTR,nta,S,2,true,"Arg/N-end rule seed, prt6 vs. Wt",99,29168982,"MASCOT Score",62.3000000,,,,,0.087279997766018,-0.9930874
SFQDLEAGTR,nta,S,2,true,"HUNTER N-terminome: legumain, GluC and trypsin",119,31951383,"MaxQuant score",76.8270000,,,,,,
SFQDLEAGTR,ph,S,2,true,"Tissue atlas Arabidopsis - ProteomicsDB",114,32188942,"MaxQuant score",89.8050000,1.0000000,,,,0.00036337299388833,
SFQDLEAGTRSPAPNR,ph,S,12,true,"atm and atr DNA damage response",88,25561503,"MASCOT Score",36.0000000,1.0000000,,,,,-0.7700000
SFQDLEAGTRSPAPNR,ph,S,12,true,"Tissue atlas Arabidopsis - ProteomicsDB",114,32188942,"MaxQuant score",171.5200000,0.9960570,,,,5.8925897608183E-20,
ISQQQALLLQSR,ph,S,170,true,"Tissue atlas Arabidopsis - ProteomicsDB",114,32188942,"MaxQuant score",60.2090000,0.9999980,,,,0.011568300426006,
