Peptide,PTM,ModifiedAA,ModifiedPosition,PeptideUniqueToGene,ExperimentDesc,ExpID,PubmedID,ScoreType,IdentScore,LocProb,Log2FChange,PQ-val,QuantSig,PEP,MassErrorPPM
EVSEEDGLR,ph,S,220,true,"atm and atr DNA damage response",88,25561503,"MASCOT Score",46.0000000,1.0000000,,,,,0.0400000
EVSEEDGLR,ph,S,220,true,"Tissue atlas Arabidopsis - ProteomicsDB",114,32188942,"MaxQuant score",111.0600000,1.0000000,,,,0.00050053599989042,
SIISNNSPGNEAK,ph,S,230,true,"atm and atr DNA damage response",88,25561503,"MASCOT Score",44.0000000,1.0000000,,,,,-0.8400000
SIISNNSPGNEAK,ph,S,230,true,"Tissue atlas Arabidopsis - ProteomicsDB",114,32188942,"MaxQuant score",138.0900000,0.9999980,,,,2.0272500478313E-5,
SIISNNSPGNEAK,ph,S,233,true,"Conserved plant phosphoproteome - Arabidopsis",61a,20466843,"MASCOT Score",51.0000000,1.0000000,,,,,
SIISNNSPGNEAK,ph,S,233,true,"atm and atr DNA damage response",88,25561503,"MASCOT Score",44.0000000,1.0000000,,,,,-0.8400000
SIISNNSPGNEAK,ph,S,233,true,"Tissue atlas Arabidopsis - ProteomicsDB",114,32188942,"MaxQuant score",226.5400000,1.0000000,,,,0,
SRVSEDEQRNDDTSNVATYGEDQISGR,ph,S,243,true,"TOR Kinase and ABA Receptor",100,29290610,XCorr,3.8242671,0.8832000,,,,0.001083999988623,
SRVSEDEQR,ph,S,243,true,"atm and atr DNA damage response",88,25561503,"MASCOT Score",48.0000000,1.0000000,,,,,0.2700000
SRVSEDEQR,ph,S,243,true,"Tissue atlas Arabidopsis - ProteomicsDB",114,32188942,"MaxQuant score",129.3700000,0.9999710,,,,9.1203197287506E-35,
NDDTSNVATYGEDQISGR,ph,S,253,true,"Tissue atlas Arabidopsis - ProteomicsDB",114,32188942,"MaxQuant score",172.6000000,0.9957130,,,,9.4419495525212E-28,
NFTGSQIEEEEEDREETTK,ph,S,292,true,"TOR Kinase and ABA Receptor",100,29290610,XCorr,2.6046777,0.8592000,,,,0.0021319999359548,
NFTGSQIEEEEEDREETTK,ph,S,292,true,"Tissue atlas Arabidopsis - ProteomicsDB",114,32188942,"MaxQuant score",301.7300000,1.0000000,,,,0,
ELDPETPTSVSTLFNK,ph,T,312,true,"TOR Kinase and ABA Receptor",100,29290610,XCorr,3.6211677,0.9886000,,,,9.4739998530713E-6,
ELDPETPTSVSTLFNK,ph,T,312,true,"Tissue atlas Arabidopsis - ProteomicsDB",114,32188942,"MaxQuant score",270.7500000,0.9999850,,,,0,
ELDPETPTSVSTLFNKK,ph,S,315,true,"Tissue atlas Arabidopsis - ProteomicsDB",114,32188942,"MaxQuant score",51.4690000,0.8125860,,,,0.016888700425625,
EEDNSSEMDVDLEK,ph,S,492,true,"Tissue atlas Arabidopsis - ProteomicsDB",114,32188942,"MaxQuant score",173.7100000,0.9853940,,,,5.7075001691994E-16,
LVTMQDKESAEDPGEFSNSYEEASNGHGGLTMASMAK,ph,S,545,true,"Tissue atlas Arabidopsis - ProteomicsDB",114,32188942,"MaxQuant score",133.8700000,0.9951370,,,,0,
SLLPLLDAAENESEDGSQGLPESDEK,ph,S,586,true,"Brassinosteroid-Regulated Phosphorylation Dynamics",94,26187819,"MaxQuant Score",125.5800000,1.0000000,,,,1.0299999920896E-13,-1.5900000
SLLPLLDAAENESEDGSQGLPESDEK,ph,S,586,true,"TOR Kinase and ABA Receptor",100,29290610,XCorr,4.3598747,0.9999000,,,,9.9990000308026E-5,
SLLPLLDAAENESEDGSQGLPESDEK,ph,S,590,true,"Brassinosteroid-Regulated Phosphorylation Dynamics",94,26187819,"MaxQuant Score",125.5800000,1.0000000,,,,1.0299999920896E-13,-1.5900000
SLLPLLDAAENESEDGSQGLPESDEK,ph,S,590,true,"TOR Kinase and ABA Receptor",100,29290610,XCorr,4.3598747,0.9926000,,,,9.9990000308026E-5,
NFGSDSEKLEIIK,ph,S,603,true,"Tyrosine phosphorylation in Arabidopsis",59,18463617,"MASCOT Score",51.0000000,,,,,,-1.0906341
NFGSDSEKLEIIK,ph,S,603,true,"srk2dei ABA signaling phopshoproteomics",83,23572148,"MASCOT Score",23.0000000,,,,,,0.0003000
NFGSDSEKLEIIK,ph,S,603,true,"atm and atr DNA damage response",88,25561503,"MASCOT Score",28.0000000,1.0000000,,,,,-0.0900000
NFGSDSEKLEIIK,ph,S,603,true,"Tissue atlas Arabidopsis - ProteomicsDB",114,32188942,"MaxQuant score",238.5100000,1.0000000,,,,0,
NFGSDSEK,ph,S,603,true,"atm and atr DNA damage response",88,25561503,"MASCOT Score",35.0000000,0.9980000,,,,,-0.8500000
NFGSDSEKLEIIK,ph,S,605,true,"Tissue atlas Arabidopsis - ProteomicsDB",114,32188942,"MaxQuant score",63.4210000,1.0000000,,,,0.0044558201916516,
