Peptide,PTM,ModifiedAA,ModifiedPosition,PeptideUniqueToGene,ExperimentDesc,ExpID,PubmedID,ScoreType,IdentScore,LocProb,Log2FChange,PQ-val,QuantSig,PEP,MassErrorPPM
IFSQR,ph,S,48,false,"Phosphorylation Early Elicitor Signaling",23,17317660,,,,,,,,
IFSQR,ph,S,48,false,"Lateral root-induction - NAA vs control",106,23328941,"MASCOT Score",21.0000000,,,,,,
AASGNNVFTSPE,nt,A,57,true,"Arg/N-end rule seed, prt6 vs. Wt",99,29168982,"MASCOT Score",60.5500000,,0.6611909,0.2086333,NO,3.6779998481506E-5,-4.5101569
ASGNNVFTSPE,nt,A,58,true,"Arg/N-end rule seed, prt6 vs. Wt",99,29168982,"MASCOT Score",34.0000000,,0.2337588,0.3822762,NO,0.00042699999175966,-4.2877711
MLASEGIKR,ph,S,163,true,"Phosphorylation in N starvation",63,22060019,"MASCOT Score",24.0000000,,,,,,-5.1747900
VDLGRDEFTKR,ac,K,178,true,"Quantitative Acetylproteomics",101,29440448,,,,,,,,
YGGTITNQIK,ph,T,190,true,"Tissue atlas Arabidopsis - ProteomicsDB",114,32188942,"MaxQuant score",83.0450000,0.9985040,,,,0.0063179200515151,
YGGTITNQIKR,ac,K,196,true,"Quantitative Acetylproteomics",101,29440448,,,,,,,,
LDKEETLLSLPLPECWAVSK,sno,C,693,true,"Site-specific nitrosomeproteomic id - gsnor1-3",90b,25699590,XCorr,2.5700000,,,,,0.0072050001472235,-7.3600000
NVESIKR,ac,K,809,true,"Quantitative Acetylproteomics",101,29440448,,,,,,,,
AEYSVEPVKR,ac,K,834,true,"Quantitative Acetylproteomics",101,29440448,,,,,,,,
