Peptide,PTM,ModifiedAA,ModifiedPosition,PeptideUniqueToGene,ExperimentDesc,ExpID,PubmedID,ScoreType,IdentScore,LocProb,Log2FChange,PQ-val,QuantSig,PEP,MassErrorPPM
SLNNTASEASNLVNSSHDALSENAESK,ph,S,86,true,"Tissue atlas Arabidopsis - ProteomicsDB",114,32188942,"MaxQuant score",119.7800000,0.9812430,,,,9.9790596779996E-35,
SLNNTASEASNLVNSSHDALSENAESK,ph,S,89,true,"Tissue atlas Arabidopsis - ProteomicsDB",114,32188942,"MaxQuant score",221.2300000,0.9988810,,,,0,
SLNNTASEASNLVNSSHDALSENAESK,ph,S,100,true,"Tissue atlas Arabidopsis - ProteomicsDB",114,32188942,"MaxQuant score",264.6100000,0.9991490,,,,0,
CSGISDDSGAAAMTSKPSLSGSR,ph,S,130,true,"Tissue atlas Arabidopsis - ProteomicsDB",114,32188942,"MaxQuant score",239.0900000,0.9768510,,,,0,
LESLQNPSSNHDDRVSSEK,ph,S,212,true,"Tissue atlas Arabidopsis - ProteomicsDB",114,32188942,"MaxQuant score",137.7200000,0.7801920,,,,5.0492698070969E-16,
LESLQNPSSNHDDRVSSEK,ph,S,220,true,"TOR Kinase and ABA Receptor",100,29290610,XCorr,3.6201153,0.8289000,,,,0.012640000320971,
HADKIEAAPDAKR,ub,K,364,true,"Arabidopsis ubiquitination COFRADIC",40,26744219,"MaxQuant Score",51.6430000,1.0000000,,,,0.00062250002520159,0.5680000
RQVVEASTGSPK,ph,S,382,true,"atm and atr DNA damage response",88,25561503,"MASCOT Score",63.0000000,1.0000000,,,,,-0.2300000
RQVVEASTGSPK,ph,S,382,true,"Phospho cell culture sucrose/TOR",109,30833711,,,0.9942770,,,,,
RQVVEASTGSPK,ph,S,382,true,"Tissue atlas Arabidopsis - ProteomicsDB",114,32188942,"MaxQuant score",160.8400000,0.9999850,,,,1.0539499828432E-10,
QVVEASTGSPKK,ph,S,382,true,"atm and atr DNA damage response",88,25561503,"MASCOT Score",45.0000000,1.0000000,,,,,-1.0700000
QVVEASTGSPK,ph,S,382,true,"STN8 phosphoproteome",38,21768351,"MASCOT Score",55.6100000,,,,,,-0.0780555
QVVEASTGSPK,ph,S,382,true,"atm and atr DNA damage response",88,25561503,"MASCOT Score",63.0000000,0.9460000,,,,,-1.2200000
ETSFKGLDR,ph,T,398,true,"atm and atr DNA damage response",88,25561503,"MASCOT Score",24.0000000,0.9440000,,,,,-0.3700000
ETSFKGLDR,ph,T,398,true,"Tissue atlas Arabidopsis - ProteomicsDB",114,32188942,"MaxQuant score",87.1840000,0.7861280,,,,0.0012823300203308,
ETSFKGLDR,ph,S,399,true,"Tissue atlas Arabidopsis - ProteomicsDB",114,32188942,"MaxQuant score",102.5500000,0.9981380,,,,0.0013184699928388,
LNHQTSFSDDTESAR,ph,T,414,true,"srk2dei ABA signaling phopshoproteomics",83,23572148,"MASCOT Score",40.0000000,,,,,,0.0002000
LNHQTSFSDDTESAR,ph,T,414,true,"Lateral root-induction - NAA vs control",106,23328941,"MASCOT Score",36.0000000,,,,,,
GKLNHQTSFSDDTESAR,ph,S,415,true,"Chloroplast kinase substrates",60,19376835,"MASCOT Score",41.6600000,,,,,,1.7333400
LNHQTSFSDDTESAR,ph,S,415,true,"SnRK2 protein kinase substrates",85,23776212,XCorr,2.2447844,0.8600000,,,,0.0090682003647089,
LNHQTSFSDDTESAR,ph,S,415,true,"atm and atr DNA damage response",88,25561503,"MASCOT Score",67.0000000,0.9900000,,,,,-0.4900000
LNHQTSFSDDTESAR,ph,S,415,true,"TOR Kinase and ABA Receptor",100,29290610,XCorr,4.9598174,0.8999000,,,,3.028000037375E-6,
LNHQTSFSDDTESAR,ph,S,415,true,"Lateral root-induction - NAA vs control",106,23328941,"MASCOT Score",41.0000000,,,,,,
LNHQTSFSDDTESAR,ph,S,415,true,"Phospho cell culture sucrose/TOR",109,30833711,,,0.9818830,,,,,
LNHQTSFSDDTESAR,ph,S,415,true,"Col-0 callus - FC Col-0 vs. Col-0 Xray",111a,31410901,,26.5400000,,-0.7618117,0.0000000,NO,,1.1885478
LNHQTSFSDDTESAR,ph,S,415,true,"Col-0 X-ray callus - FC Col-0 vs. Col-0 Xray",111b,31410901,,26.5400000,,-0.7618117,0.0000000,NO,,1.1885478
LNHQTSFSDDTESAR,ph,S,415,true,"atm callus - FC atm vs. atm Xray",111c,31410901,,26.5400000,,1.4641287,0.0000000,NO,,1.1885478
LNHQTSFSDDTESAR,ph,S,415,true,"atm-3 X-ray callus - FC atm vs. atm Xray",111d,31410901,,26.5400000,,1.4641287,0.0000000,NO,,1.1885478
LNHQTSFSDDTESAR,ph,S,415,true,"Tissue atlas Arabidopsis - ProteomicsDB",114,32188942,"MaxQuant score",242.6700000,0.9990320,,,,0,
LNHQTSFSDDTESAR,ph,S,417,true,"Tissue atlas Arabidopsis - ProteomicsDB",114,32188942,"MaxQuant score",119.4600000,0.9756950,,,,3.4080699151673E-6,
SAGSQLQPPK,ph,S,425,true,"atm and atr DNA damage response",88,25561503,"MASCOT Score",26.0000000,1.0000000,,,,,-1.7600000
SSSFNCSSSKPK,ph,S,442,true,"SnRK2 protein kinase substrates",85,23776212,XCorr,2.3323765,0.7890000,,,,0.030855499207973,
SSSFNCSSSKPK,ph,S,442,true,"atm and atr DNA damage response",88,25561503,"MASCOT Score",36.0000000,0.8830000,,,,,-1.6000000
SSSFNCSSSKPK,ph,S,442,true,"Tissue atlas Arabidopsis - ProteomicsDB",114,32188942,"MaxQuant score",150.2900000,0.9997940,,,,1.0358299959989E-6,
SSSFNCSSSK,ph,S,442,true,"atm and atr DNA damage response",88,25561503,"MASCOT Score",55.0000000,0.9980000,,,,,0.2200000
SSSFNCSSSKPK,ph,S,446,true,"Tissue atlas Arabidopsis - ProteomicsDB",114,32188942,"MaxQuant score",75.3780000,0.8694190,,,,0.0044241398572922,
EANASASSIDQKLKSR,ub,K,541,true,"Arabidopsis ubiquitination COFRADIC",40,26744219,"MaxQuant Score",68.4810000,0.9490000,,,,8.476000346036E-8,-0.1380000
DLKGLQSDGKR,ub,K,558,true,"Arabidopsis ubiquitination COFRADIC",40,26744219,"MaxQuant Score",54.3430000,1.0000000,,,,0.0040000001899898,0.1920000
DLKGLQSDGKR,ub,K,565,true,"Arabidopsis ubiquitination COFRADIC",40,26744219,"MaxQuant Score",62.0880000,1.0000000,,,,0.003000000026077,0.0890000
LENSVVSGGDISTNEK,ph,S,587,true,"Tissue atlas Arabidopsis - ProteomicsDB",114,32188942,"MaxQuant score",151.4100000,0.9999560,,,,1.3587400518947E-13,
GGQTAESSDTSGVSDSDLSTTK,ph,S,679,true,"Conserved plant phosphoproteome - Arabidopsis",61a,20466843,"MASCOT Score",30.0000000,1.0000000,,,,,
GGQTAESSDTSGVSDSDLSTTK,ph,S,686,true,"TOR Kinase and ABA Receptor",100,29290610,XCorr,6.1789799,0.8900000,,,,3.1930000310432E-11,
GGQTAESSDTSGVSDSDLSTTK,ph,S,686,true,"Tissue atlas Arabidopsis - ProteomicsDB",114,32188942,"MaxQuant score",317.8500000,0.9938980,,,,0,
ELCQTSSPSK,ph,S,1003,true,"atm and atr DNA damage response",88,25561503,"MASCOT Score",43.0000000,0.9400000,,,,,-0.4500000
ELCQTSSPSK,ph,S,1003,true,"Tissue atlas Arabidopsis - ProteomicsDB",114,32188942,"MaxQuant score",155.4800000,0.8934050,,,,8.9796202473735E-7,
SPSKKEDIALK,ph,S,1046,true,"Tissue atlas Arabidopsis - ProteomicsDB",114,32188942,"MaxQuant score",112.1700000,0.9832470,,,,1.0791300155688E-5,
SPSKKEDIALK,ph,S,1048,true,"Tissue atlas Arabidopsis - ProteomicsDB",114,32188942,"MaxQuant score",85.9090000,0.9996260,,,,0.00022212299518287,
VELNNDGLCEGSPNKK,ph,S,1159,true,"Conserved plant phosphoproteome - Arabidopsis",61a,20466843,"MASCOT Score",30.0000000,1.0000000,,,,,
VELNNDGLCEGSPNKK,ph,S,1159,true,"SnRK2 protein kinase substrates",85,23776212,XCorr,3.1287341,1.0000000,,,,0.0069606099277735,
VELNNDGLCEGSPNKK,ph,S,1159,true,"atm and atr DNA damage response",88,25561503,"MASCOT Score",59.0000000,1.0000000,,,,,-2.3200000
VELNNDGLCEGSPNKK,ph,S,1159,true,"Phospho cell culture sucrose/TOR",109,30833711,,,1.0000000,,,,,
VELNNDGLCEGSPNKK,ph,S,1159,true,"Col-0 callus - FC Col-0 vs. Col-0 Xray",111a,31410901,,46.2200000,,0.6068503,0.0000000,NO,,1.2453268
VELNNDGLCEGSPNKK,ph,S,1159,true,"Col-0 X-ray callus - FC Col-0 vs. Col-0 Xray",111b,31410901,,46.2200000,,0.6068503,0.0000000,NO,,1.2453268
VELNNDGLCEGSPNKK,ph,S,1159,true,"atm callus - FC atm vs. atm Xray",111c,31410901,,46.2200000,,0.5354044,0.0000000,NO,,1.2453268
VELNNDGLCEGSPNKK,ph,S,1159,true,"atm-3 X-ray callus - FC atm vs. atm Xray",111d,31410901,,46.2200000,,0.5354044,0.0000000,NO,,1.2453268
VELNNDGLCEGSPNKK,ph,S,1159,true,"Tissue atlas Arabidopsis - ProteomicsDB",114,32188942,"MaxQuant score",367.3100000,1.0000000,,,,0,
VELNNDGLCEGSPNK,ph,S,1159,true,"Tyrosine phosphorylation in Arabidopsis",59,18463617,"MASCOT Score",36.0000000,,,,,,-2.0873146
VELNNDGLCEGSPNK,ph,S,1159,true,"Conserved plant phosphoproteome - Arabidopsis",61a,20466843,"MASCOT Score",61.0000000,1.0000000,,,,,
VELNNDGLCEGSPNK,ph,S,1159,true,"atm and atr DNA damage response",88,25561503,"MASCOT Score",47.0000000,1.0000000,,,,,0.2700000
VELNNDGLCEGSPNK,ph,S,1159,true,"Lateral root-induction - NAA vs control",106,23328941,"MASCOT Score",32.0000000,,,,,,
