Peptide,PTM,ModifiedAA,ModifiedPosition,PeptideUniqueToGene,ExperimentDesc,ExpID,PubmedID,ScoreType,IdentScore,LocProb,Log2FChange,PQ-val,QuantSig,PEP,MassErrorPPM
DKSMSIALSR,ph,S,373,false,"Tissue atlas Arabidopsis - ProteomicsDB",114,32188942,"MaxQuant score",103.1100000,0.9918400,,,,0.00064173102146015,
SMSIALSR,ph,S,375,false,"Tissue atlas Arabidopsis - ProteomicsDB",114,32188942,"MaxQuant score",91.0950000,0.9994240,,,,0.0047603901475668,
SMSIALSR,ph,S,379,false,"Tissue atlas Arabidopsis - ProteomicsDB",114,32188942,"MaxQuant score",82.7490000,0.9999720,,,,0.0082827098667622,
HGSCSVTPFCISR,ph,S,383,true,"Tissue atlas Arabidopsis - ProteomicsDB",114,32188942,"MaxQuant score",95.8540000,0.9996180,,,,0.00025731499772519,
HGSCSVTPFCISR,ph,T,387,true,"Tissue atlas Arabidopsis - ProteomicsDB",114,32188942,"MaxQuant score",198.3100000,0.9997350,,,,2.4715000063327E-30,
SIDETNATAQSLK,ph,S,476,true,"Pollen phosphoproteome Arabidopsis",43,22631563,"MASCOT Score",51.8100000,,,,,,-9.7606000
SIDETNATAQSLK,ph,S,476,true,"Tissue atlas Arabidopsis - ProteomicsDB",114,32188942,"MaxQuant score",279.6500000,1.0000000,,,,0,
SIDETNATAQSLK,ph,S,486,true,"Tissue atlas Arabidopsis - ProteomicsDB",114,32188942,"MaxQuant score",263.0300000,1.0000000,,,,0,
ISYSNYSSEEEDNEK,ph,S,496,true,"Tissue atlas Arabidopsis - ProteomicsDB",114,32188942,"MaxQuant score",115.8700000,0.9354340,,,,4.2550300349831E-6,
SSCKSNEESTFSR,ph,S,512,true,"Tissue atlas Arabidopsis - ProteomicsDB",114,32188942,"MaxQuant score",238.5100000,1.0000000,,,,0,
INSLAHDDKEEDEEENHETR,ph,S,540,true,"Tissue atlas Arabidopsis - ProteomicsDB",114,32188942,"MaxQuant score",150.9400000,1.0000000,,,,5.4610197784418E-25,
SYSDHDDSPR,ph,S,560,true,"Tissue atlas Arabidopsis - ProteomicsDB",114,32188942,"MaxQuant score",134.6100000,0.9999010,,,,3.5025600482186E-6,
SYSDHDDSPR,ph,S,565,true,"Tissue atlas Arabidopsis - ProteomicsDB",114,32188942,"MaxQuant score",165.4400000,1.0000000,,,,3.0744999435228E-7,
INSLSHDDDEEEEEENHQTR,ph,S,575,true,"Tissue atlas Arabidopsis - ProteomicsDB",114,32188942,"MaxQuant score",283.4100000,0.9996600,,,,0,
INSLSHDDDEEEEEENHQTR,ph,S,577,true,"Tissue atlas Arabidopsis - ProteomicsDB",114,32188942,"MaxQuant score",167.7400000,0.9995970,,,,1.1688999882263E-35,
SEDQSVYSDDDAGESGESSLHR,ph,S,608,true,"Tissue atlas Arabidopsis - ProteomicsDB",114,32188942,"MaxQuant score",207.1300000,1.0000000,,,,0,
EEEHISSDHD,ph,S,633,true,"Tissue atlas Arabidopsis - ProteomicsDB",114,32188942,"MaxQuant score",182.3900000,0.9772250,,,,9.4728702659808E-10,
