Peptide,PTM,ModifiedAA,ModifiedPosition,PeptideUniqueToGene,ExperimentDesc,ExpID,PubmedID,ScoreType,IdentScore,LocProb,Log2FChange,PQ-val,QuantSig,PEP,MassErrorPPM
TGKAKPKKHTAKELQAKA,nt,T,2,true,"Arabidopsis translation initiation landscape - NT",167b,35069635,,,,,,,,
AKADAALTNR,nt,A,17,true,"Arabidopsis translation initiation landscape - NT",167b,35069635,,,,,,,,
ADAALTNRGGGK,me1,R,26,true,"Arabidopsis protein methylome",123,31809900,"MaxQuant Score",83.1820000,1.0000000,,,,3.317859955132E-5,-0.2882900
GGGKAGLADR,ub,K,30,true,"Arabidopsis ubiquitination COFRADIC",40,26744219,"MaxQuant Score",77.0620000,1.0000000,,,,0.0049999998882413,-0.2250000
YECPHCK,so,C,52,false,"S-sulfenylation site detection using YAP1C",110,32714340,,,,,,,,
TMQIHHESK,mox,M,62,false,"cat2 Methionine oxidation - 3h stress",62b,25693801,"MASCOT Score",34.0000000,,1.8856113,,NO,,
SKHPKLTYEEPRNLHE,nt,S,68,true,"Arabidopsis translation initiation landscape - NT",167b,35069635,,,,,,,,
HPKLTYEEPR,ph,T,74,true,"srk2dei ABA signaling phopshoproteomics",83,23572148,"MASCOT Score",45.0000000,,,,,,-0.0006000
HPKLTYEEPR,ph,T,74,true,"atm and atr DNA damage response",88,25561503,"MASCOT Score",38.0000000,0.9520000,,,,,0.1300000
HPKLTYEEPR,ph,T,74,true,"TOR Kinase and ABA Receptor",100,29290610,XCorr,2.5085144,0.9963000,,,,0.00092169997515157,
HPKLTYEEPR,ph,T,74,true,"Tissue atlas Arabidopsis - ProteomicsDB",114,32188942,"MaxQuant score",123.9500000,1.0000000,,,,4.7146600991255E-5,
HPKLTYEEPR,ph,T,74,true,"Touch-induced phosphorylation: 40s touch vs untouc",136,30291188,"MASCOT score",45.2300000,,0.0470432,0.7084524,NO,,11.3702410
LTYEEPR,ph,T,74,true,"STN8 phosphoproteome",38,21768351,"MASCOT Score",44.9400000,,,,,,0.3081850
LTYEEPR,ph,T,74,true,"Chloroplast kinase substrates",60,19376835,"MASCOT Score",42.5100000,,,,,,1.5222400
LTYEEPR,ph,T,74,true,"LAXIC - mannitol vs control",84b,23660473,XCorr,2.2500000,0.9970000,,,,0.005349790211767,
LTYEEPR,ph,T,74,true,"TOR Kinase and ABA Receptor",100,29290610,XCorr,2.3683946,0.9999000,,,,0.026620000600815,
NLHEALAAPAESSKPKPGIR,ph,S,91,true,"Tissue atlas Arabidopsis - ProteomicsDB",114,32188942,"MaxQuant score",94.8370000,0.8875340,,,,6.4144401790145E-8,
NLHEALAAPAESSKPKPGIR,ub,K,93,true,"Arabidopsis ubiquitination COFRADIC",40,26744219,"MaxQuant Score",80.2360000,0.9390000,,,,1.5640000149908E-17,-0.1370000
