Peptide,PTM,ModifiedAA,ModifiedPosition,PeptideUniqueToGene,ExperimentDesc,ExpID,PubmedID,ScoreType,IdentScore,LocProb,Log2FChange,PQ-val,QuantSig,PEP,MassErrorPPM
VTVGQVTE,nt,V,75,true,"Arg/N-end rule seed, prt6 vs. Wt",99,29168982,"MASCOT Score",43.4200000,,0.3253430,0.2604444,NO,0.016319999471307,0.0077289
VIAPKYK,ac,K,118,false,"Quantitative Acetylproteomics",101,29440448,,,,,,,,
YQDMVFLK,mox,M,129,true,"cat2 Methionine oxidation - 1h stress",62a,25693801,"MASCOT Score",61.0000000,,0.1898159,,NO,,
YQDMVFLK,mox,M,129,true,"cat2 Methionine oxidation - 3h stress",62b,25693801,"MASCOT Score",45.0000000,,-0.0886658,,NO,,
LDCNQDNKPLAK,sno,C,136,true,"Site-specific nitrosomeproteomic id - gsnor1-3",90a,25699590,XCorr,2.4916422,,,,,0.00077139999484643,-6.9485609
LDCNQDNKPLAK,sno,C,136,true,"Site-specific nitrosomeproteomic id - gsnor1-3",90b,25699590,XCorr,2.8281651,,,,,0.11389999836683,-7.2183523
LDCNQDNKPLAK,sno,C,136,true,"hot5-4 / wildtype, FAT-switch S-nitrosoproteome",169,37277371,,,,,,,,
LDCNQDNKPLAK,so,C,136,true,"Arabidopsis S-sulfenylation chemoproteomics",108,31578252,"pFind PSM Score",0.0083752,,2.4868000,,,,-0.8903633
PLAKELGIR,ub,K,145,false,"Arabidopsis ubiquitination COFRADIC",40,26744219,"MaxQuant Score",63.8160000,1.0000000,,,,0.017000000923872,0.1390000
VVPTFKILK,ac,K,156,false,"Quantitative Acetylproteomics",101,29440448,,,,,,,,
