Peptide,PTM,ModifiedAA,ModifiedPosition,PeptideUniqueToGene,ExperimentDesc,ExpID,PubmedID,ScoreType,IdentScore,LocProb,Log2FChange,PQ-val,QuantSig,PEP,MassErrorPPM
AQSNKVSTGASSNAAKVDGPSSAE,nt,A,62,true,"Stromal N-terminome",96,26371235,"MASCOT Score",31.0000000,,,,,,
AQSNKVSTGASSNAAKV,nt,A,62,true,"Arabidopsis translation initiation landscape - NT",167b,35069635,,,,,,,,
QSNKVSTGASSNAAKVDGPSSAE,nt,Q,63,true,"HUNTER N-terminome: legumain, GluC and trypsin",119,31951383,"MaxQuant score",122.7700000,,,,,,
QSNKVSTGASSNAAKV,nt,Q,63,true,"Arabidopsis translation initiation landscape - NT",167b,35069635,,,,,,,,
SNKVSTGASSNAAKVDGPSSAEGKE,nt,S,64,true,"Stromal N-terminome",96,26371235,"MASCOT Score",30.5700000,,,,,,
SNKVSTGASSNAAKVDGPSSAE,nt,S,64,true,"N-terminal ChaFRADIC",92,26010716,"MASCOT Score",23.8300000,,,,,1.0039999942535E-9,
SNKVSTGASSNAAKVDGPSSAE,nt,S,64,true,"HUNTER N-terminome: legumain, GluC and trypsin",119,31951383,"MaxQuant score",162.8500000,,,,,,
SNKVSTGASSNAAKVDGPSSAE,nt,S,64,true,"Arabidopsis translation initiation landscape - NT",167b,35069635,,,,,,,,
QLDCELVIR,sno,C,137,true,"S-Nitroso-Proteome guard cells - 60 min flg22",116c,32121556,,,,0.7739963,0.0010000,YES,,
SDHTGTVVDIVAE,nt,S,252,true,"N-terminal ChaFRADIC",92,26010716,"MASCOT Score",42.0800000,,,,,2.3659999897063E-6,
