Peptide,PTM,ModifiedAA,ModifiedPosition,PeptideUniqueToGene,ExperimentDesc,ExpID,PubmedID,ScoreType,IdentScore,LocProb,Log2FChange,PQ-val,QuantSig,PEP,MassErrorPPM
VEPVNSSLGKMLLE,nt,V,2,true,"Arg/N-end rule seed, prt6 vs. Wt",99,29168982,"MASCOT Score",39.2100000,,,,,3.0410001272685E-7,1.9052446
VEPVNSSLGKM,nt,V,2,true,"Arg/N-end rule seed, prt6 vs. Wt",99,29168982,"MASCOT Score",53.3000000,,,,,0.013389999978244,-1.8018290
VEPVNSSLGK,nt,V,2,true,"Arg/N-end rule seed, prt6 vs. Wt",99,29168982,"MASCOT Score",48.6800000,,,,,0.10570000112057,-0.3151159
VEPVNSSLGKMLLEE,nta,V,2,true,"Arabidopsis translation initiation landscape - NTA",167a,35069635,,,,,,,,
VEPVNSSLGKMLLE,nta,V,2,true,"Arg/N-end rule seed, prt6 vs. Wt",99,29168982,"MASCOT Score",39.2100000,,0.5535084,0.4747241,NO,3.0410001272685E-7,1.9052446
VEPVNSSLGKM,nta,V,2,true,"Arg/N-end rule seed, prt6 vs. Wt",99,29168982,"MASCOT Score",53.3000000,,-0.1744206,0.0108414,NO,0.013389999978244,-1.8018290
VEPVNSSLGK,nta,V,2,true,"Arg/N-end rule seed, prt6 vs. Wt",99,29168982,"MASCOT Score",48.6800000,,0.3918948,0.3616364,NO,0.10570000112057,-0.3151159
EGNVEHQANPWASFK,ph,S,245,true,"Tissue atlas Arabidopsis - ProteomicsDB",114,32188942,"MaxQuant score",214.3400000,1.0000000,,,,0,
SSVSADKLGCALTGDDIVEIK,ph,S,251,true,"Tissue atlas Arabidopsis - ProteomicsDB",114,32188942,"MaxQuant score",167.1000000,0.8920960,,,,1.2888999961263E-35,
ALTGDDIVE,nt,A,258,true,"Arg/N-end rule seed, prt6 vs. Wt",99,29168982,"MASCOT Score",76.7100000,,-1.3770728,0.0376943,YES,0.00010520000068936,-1.6284514
NCNQVNHAIR,so,C,484,true,"Arabidopsis S-sulfenylation chemoproteomics",108,31578252,"pFind PSM Score",0.0034657,,0.9220700,,,,-1.2762393
SNWLELQSK,ph,S,620,true,"Tissue atlas Arabidopsis - ProteomicsDB",114,32188942,"MaxQuant score",121.5800000,1.0000000,,,,0.00026480099768378,
SNWLELQSK,ph,S,627,true,"Tissue atlas Arabidopsis - ProteomicsDB",114,32188942,"MaxQuant score",171.0900000,1.0000000,,,,6.0944101278437E-5,
NKSESPTK,ph,S,821,true,"atm and atr DNA damage response",88,25561503,"MASCOT Score",31.0000000,0.9970000,,,,,-3.8800000
LAKSSSPSAVPDLPK,ac,K,1080,true,"Quantitative Acetylproteomics",101,29440448,,,,,,,,
SSSPSAVPDLPK,ph,S,1081,true,"srk2dei ABA signaling phopshoproteomics",83,23572148,"MASCOT Score",30.0000000,,,,,,0.0005000
SSSPSAVPDLPK,ph,S,1081,true,"Lateral root-induction - NAA vs control",106,23328941,"MASCOT Score",21.0000000,,,,,,
SSSPSAVPDLPK,ph,S,1082,true,"srk2dei ABA signaling phopshoproteomics",83,23572148,"MASCOT Score",33.0000000,,,,,,-0.0010000
SSSPSAVPDLPK,ph,S,1082,true,"Lateral root-induction - NAA vs control",106,23328941,"MASCOT Score",37.0000000,,,,,,
SSSPSAVPDLPK,ph,S,1083,true,"Large-scale phosphorylation discovery",44,23111157,XCorr,3.4440000,,,,,,
SSSPSAVPDLPK,ph,S,1083,true,"Tyrosine phosphorylation in Arabidopsis",59,18463617,"MASCOT Score",54.0000000,,,,,,-1.5036727
SSSPSAVPDLPK,ph,S,1083,true,"srk2dei ABA signaling phopshoproteomics",83,23572148,"MASCOT Score",55.0000000,,,,,,0.0008000
SSSPSAVPDLPK,ph,S,1083,true,"SnRK2 protein kinase substrates",85,23776212,XCorr,2.0187058,0.9000000,,,,0.0029511000029743,
SSSPSAVPDLPK,ph,S,1083,true,"atm and atr DNA damage response",88,25561503,"MASCOT Score",47.0000000,0.9480000,,,,,-0.3600000
SSSPSAVPDLPK,ph,S,1083,true,"Lateral root-induction - NAA vs control",106,23328941,"MASCOT Score",29.0000000,,,,,,
SSSPSAVPDLPK,ph,S,1083,true,"Phospho cell culture sucrose/TOR",109,30833711,,,0.9929860,,,,,
SSSPSAVPDLPK,ph,S,1083,true,"Tissue atlas Arabidopsis - ProteomicsDB",114,32188942,"MaxQuant score",145.8100000,0.9999330,,,,1.133359961436E-9,
SSSPSAVPDLPK,ph,S,1085,true,"srk2dei ABA signaling phopshoproteomics",83,23572148,"MASCOT Score",39.0000000,,,,,,0.0014000
LTSDVMGSR,ph,S,1189,true,"Tissue atlas Arabidopsis - ProteomicsDB",114,32188942,"MaxQuant score",132.3200000,1.0000000,,,,0.00011211699893465,
