Peptide,PTM,ModifiedAA,ModifiedPosition,PeptideUniqueToGene,ExperimentDesc,ExpID,PubmedID,ScoreType,IdentScore,LocProb,Log2FChange,PQ-val,QuantSig,PEP,MassErrorPPM
SVPSIDKSEEMDSDEFGGNRPEIQR,ph,S,116,true,"Tissue atlas Arabidopsis - ProteomicsDB",114,32188942,"MaxQuant score",118.6100000,0.9975770,,,,1.6004700345937E-23,
SEEMDSDEFGGNRPEIQR,ph,S,121,true,"Tissue atlas Arabidopsis - ProteomicsDB",114,32188942,"MaxQuant score",76.4170000,0.9999990,,,,7.8875898907427E-5,
EVEEQISTLSEEVVNPTVEK,ph,S,331,true,"Tissue atlas Arabidopsis - ProteomicsDB",114,32188942,"MaxQuant score",201.9500000,0.9940290,,,,0,
VSISAEK,ph,S,350,true,"Tissue atlas Arabidopsis - ProteomicsDB",114,32188942,"MaxQuant score",150.1100000,0.9992480,,,,4.9394799361835E-7,
EVSNYLLSPSNGNFSPR,ph,S,406,true,"Tissue atlas Arabidopsis - ProteomicsDB",114,32188942,"MaxQuant score",253.9500000,0.9999820,,,,0,
EVSNYLLSPSNGNFSPR,ph,S,408,true,"Tissue atlas Arabidopsis - ProteomicsDB",114,32188942,"MaxQuant score",197.7900000,0.9590500,,,,1.8065595854014E-39,
EVSNYLLSPSNGNFSPR,ph,S,413,true,"Tissue atlas Arabidopsis - ProteomicsDB",114,32188942,"MaxQuant score",253.9500000,0.9982040,,,,0,
VDPGIGRDSNSK,ph,S,431,true,"Tissue atlas Arabidopsis - ProteomicsDB",114,32188942,"MaxQuant score",150.9300000,0.9990420,,,,8.6483902350665E-7,
IIMDACVSLSR,cn,C,517,true,"Cellular regulation by S-cyanylation",115,30377236,,,,,,,,
EATESTAPGSPTGQGPESPK,ph,T,1125,true,"Tissue atlas Arabidopsis - ProteomicsDB",114,32188942,"MaxQuant score",56.0550000,0.8681230,,,,0.0071921199560165,
EATESTAPGSPTGQGPESPKVVAAASEDTR,ph,S,1132,true,"SnRK2 protein kinase substrates",85,23776212,XCorr,3.5706570,0.7560000,,,,5.151019877303E-8,
KEATESTAPGSPTGQGPESPK,ph,S,1132,true,"atm and atr DNA damage response",88,25561503,"MASCOT Score",60.0000000,1.0000000,,,,,-0.5900000
KEATESTAPGSPTGQGPESPK,ph,S,1132,true,"Phospho cell culture sucrose/TOR",109,30833711,,,0.9993080,,,,,
EATESTAPGSPTGQGPESPK,ph,S,1132,true,"LAXIC - mannitol vs control",84b,23660473,XCorr,3.6600000,0.9350000,,,,1.9799999506631E-7,
EATESTAPGSPTGQGPESPK,ph,S,1132,true,"SnRK2 protein kinase substrates",85,23776212,XCorr,2.7605107,0.9290000,,,,6.4137697336264E-5,
EATESTAPGSPTGQGPESPK,ph,S,1132,true,"atm and atr DNA damage response",88,25561503,"MASCOT Score",60.0000000,1.0000000,,,,,-0.2200000
EATESTAPGSPTGQGPESPK,ph,S,1132,true,"TOR Kinase and ABA Receptor",100,29290610,XCorr,5.0209498,0.9816000,,,,8.5559997842211E-7,
EATESTAPGSPTGQGPESPK,ph,S,1132,true,"Lateral root-induction - NAA vs control",106,23328941,"MASCOT Score",59.0000000,,-0.2696453,0.1813991,NO,,
EATESTAPGSPTGQGPESPK,ph,S,1132,true,"Tissue atlas Arabidopsis - ProteomicsDB",114,32188942,"MaxQuant score",184.5600000,0.9992440,,,,0,
EATESTAPGSPTGQGPESPKVVAAASEDTR,ph,T,1134,true,"Tissue atlas Arabidopsis - ProteomicsDB",114,32188942,"MaxQuant score",128.1100000,0.9120520,,,,5.4090120722938E-43,
EATESTAPGSPTGQGPESPK,ph,T,1134,true,"srk2dei ABA signaling phopshoproteomics",83,23572148,"MASCOT Score",30.0000000,,,,,,-0.0024000
EATESTAPGSPTGQGPESPK,ph,T,1134,true,"TOR Kinase and ABA Receptor",100,29290610,XCorr,4.9603825,0.9851000,,,,2.6699999011726E-7,
EATESTAPGSPTGQGPESPKVVAAASEDTR,ph,S,1140,true,"SnRK2 protein kinase substrates",85,23776212,XCorr,3.5706570,0.9560000,,,,5.151019877303E-8,
EATESTAPGSPTGQGPESPKVVAAASEDTR,ph,S,1140,true,"Tissue atlas Arabidopsis - ProteomicsDB",114,32188942,"MaxQuant score",184.5600000,0.9996680,,,,0,
KEATESTAPGSPTGQGPESPK,ph,S,1140,true,"atm and atr DNA damage response",88,25561503,"MASCOT Score",60.0000000,1.0000000,,,,,-0.5900000
KEATESTAPGSPTGQGPESPK,ph,S,1140,true,"Phospho cell culture sucrose/TOR",109,30833711,,,0.9991360,,,,,
EATESTAPGSPTGQGPESPK,ph,S,1140,true,"Large-scale phosphorylation discovery",44,23111157,XCorr,4.1770000,,,,,,
EATESTAPGSPTGQGPESPK,ph,S,1140,true,"LAXIC - mannitol vs control",84b,23660473,XCorr,3.6600000,0.9360000,,,,1.9799999506631E-7,
EATESTAPGSPTGQGPESPK,ph,S,1140,true,"SnRK2 protein kinase substrates",85,23776212,XCorr,2.7605107,0.9360000,,,,6.4137697336264E-5,
EATESTAPGSPTGQGPESPK,ph,S,1140,true,"atm and atr DNA damage response",88,25561503,"MASCOT Score",60.0000000,1.0000000,,,,,-0.2200000
EATESTAPGSPTGQGPESPK,ph,S,1140,true,"TOR Kinase and ABA Receptor",100,29290610,XCorr,5.0209498,0.9999000,,,,8.5559997842211E-7,
EATESTAPGSPTGQGPESPK,ph,S,1140,true,"Lateral root-induction - NAA vs control",106,23328941,"MASCOT Score",33.0000000,,,,,,
