Peptide,PTM,ModifiedAA,ModifiedPosition,PeptideUniqueToGene,ExperimentDesc,ExpID,PubmedID,ScoreType,IdentScore,LocProb,Log2FChange,PQ-val,QuantSig,PEP,MassErrorPPM
ADNGIQSVMSFSSVK,ph,S,70,true,"Large-scale phosphorylation discovery",44,23111157,XCorr,3.4290000,,,,,,
ADNGIQSVMSFSSVK,ph,S,70,true,"atm and atr DNA damage response",88,25561503,"MASCOT Score",41.0000000,1.0000000,,,,,0.1900000
ADNGIQSVMSFSSVK,ph,S,70,true,"TOR Kinase and ABA Receptor",100,29290610,XCorr,4.6219873,0.8109000,,,,5.2240000059101E-7,
ADNGIQSVMSFSSVK,ph,S,70,true,"Tissue atlas Arabidopsis - ProteomicsDB",114,32188942,"MaxQuant score",254.6800000,0.9522890,,,,0,
AQASSDGDEEEAIPLR,nt,A,81,true,"HUNTER N-terminome: legumain, GluC and trypsin",119,31951383,"MaxQuant score",85.5220000,,,,,,
AQASSDGDEEEAIPLR,nta,A,81,true,"HUNTER N-terminome: legumain, GluC and trypsin",119,31951383,"MaxQuant score",63.6620000,,,,,,
QASSDGDEEEAIPLR,nt,Q,82,true,"HUNTER N-terminome: legumain, GluC and trypsin",119,31951383,"MaxQuant score",134.9800000,,,,,,
ASSDGDEEEAIPLR,nt,A,83,true,"Tic56 chloroplast import - wild-type",89a,25588737,XCorr,2.6514685,,,,,,
ASSDGDEEEAIPLR,nt,A,83,true,"Tic56 chloroplast import - ppi2",89b,25588737,XCorr,3.7378471,,,,,,
ASSDGDEEEAIPLR,nt,A,83,true,"Tic56 chloroplast import - tic56-1",89c,25588737,XCorr,3.1383414,,,,,,
ASSDGDEEEAIPLR,nt,A,83,true,"N-terminal ChaFRADIC",92,26010716,"MASCOT Score",94.0100000,,,,,4.8329999117414E-5,
ASSDGDEEEAIPLR,nt,A,83,true,"Arg/N-end rule seed, prt6 vs. Wt",99,29168982,"MASCOT Score",58.9700000,,0.5836250,0.0035774,NO,0.00016080000204965,-2.4087286
ASSDGDEEEAIPLR,nt,A,83,true,"HUNTER N-terminome: legumain, GluC and trypsin",119,31951383,"MaxQuant score",212.3800000,,,,,,
ASSDGDEEEAIPL,nt,A,83,true,"N-terminal ChaFRADIC",92,26010716,"MASCOT Score",84.6800000,,,,,8.4360003427264E-9,
ASSDGDEEEAIPLR,nta,A,83,true,"N-terminal ChaFRADIC",92,26010716,"MASCOT Score",94.0100000,,,,,4.8329999117414E-5,
ASSDGDEEEAIPLR,nta,A,83,true,"FtsH12 N-terminome: WT / FtsH12 knockdown miRNA",118,33216923,"MaxQuant score",202.2800000,,,,,0,
ASSDGDEEEAIPLR,nta,A,83,true,"HUNTER N-terminome: legumain, GluC and trypsin",119,31951383,"MaxQuant score",211.4600000,,,,,,
SSDGDEEEAIPLR,nt,S,84,true,"Tic56 chloroplast import - wild-type",89a,25588737,XCorr,3.1539533,,,,,,
SSDGDEEEAIPLR,nt,S,84,true,"N-terminal ChaFRADIC",92,26010716,"MASCOT Score",52.5600000,,,,,1.8490000641691E-8,
SSDGDEEEAIPLR,nt,S,84,true,"Arg/N-end rule seed, prt6 vs. Wt",99,29168982,"MASCOT Score",61.2500000,,0.8922490,0.1985123,NO,0.0012750000460073,-1.7730880
SSDGDEEEAIPLR,nt,S,84,true,"HUNTER N-terminome: legumain, GluC and trypsin",119,31951383,"MaxQuant score",226.7100000,,,,,,
SSDGDEEEAIPL,nt,S,84,true,"N-terminal ChaFRADIC",92,26010716,"MASCOT Score",104.3300000,,,,,3.0729999878076E-8,
AQASSDGDEEEAIPLR,ph,S,84,true,"atm and atr DNA damage response",88,25561503,"MASCOT Score",37.0000000,0.9940000,,,,,0.3500000
AQASSDGDEEEAIPLRSEGK,ph,S,85,true,"Chloroplast kinase substrates",60,19376835,"MASCOT Score",38.5700000,,,,,,-0.6259540
AQASSDGDEEEAIPLRSEGK,ph,S,85,true,"TOR Kinase and ABA Receptor",100,29290610,XCorr,2.8588784,0.8380000,,,,0.047370001673698,
AQASSDGDEEEAIPLR,ph,S,85,true,"Tyrosine phosphorylation in Arabidopsis",59,18463617,"MASCOT Score",49.0000000,,,,,,-1.4716427
AQASSDGDEEEAIPLR,ph,S,85,true,"LAXIC - ABA stress",84a,23660473,XCorr,3.6600000,0.8720000,,,,3.4900000173366E-5,
AQASSDGDEEEAIPLR,ph,S,85,true,"atm and atr DNA damage response",88,25561503,"MASCOT Score",51.0000000,0.9540000,,,,,-0.2800000
AQASSDGDEEEAIPLR,ph,S,85,true,"TOR Kinase and ABA Receptor",100,29290610,XCorr,3.2230134,0.8940000,,,,0.00025219999952242,
AQASSDGDEEEAIPLR,ph,S,85,true,"Phospho cell culture sucrose/TOR",109,30833711,,,0.9988060,,,,,
AQASSDGDEEEAIPLR,ph,S,85,true,"Tissue atlas Arabidopsis - ProteomicsDB",114,32188942,"MaxQuant score",249.2000000,0.9981090,,,,0,
VSEAEKAIK,ac,K,302,true,"Histone deacetylases - apicidin vs control",98a,29061669,"MaxQuant Score",78.5000000,1.0000000,-0.0320000,0.8629785,NO,0.016000000759959,
AIKTLYGK,ac,K,305,true,"Quantitative Acetylproteomics",101,29440448,,,,,,,,
