Peptide,PTM,ModifiedAA,ModifiedPosition,PeptideUniqueToGene,ExperimentDesc,ExpID,PubmedID,ScoreType,IdentScore,LocProb,Log2FChange,PQ-val,QuantSig,PEP,MassErrorPPM
SVRVLNPNAE,nt,S,2,false,"Arg/N-end rule seed, prt6 vs. Wt",99,29168982,"MASCOT Score",43.5800000,,,,,0.0058829998597503,0.6959474
SVRVLNPNAEVLNKSAAL,nta,S,2,false,"Arabidopsis translation initiation landscape - NTA",167a,35069635,,,,,,,,
SVRVLNPNAE,nta,S,2,false,"Arg/N-end rule seed, prt6 vs. Wt",99,29168982,"MASCOT Score",43.5800000,,,,,0.0058829998597503,0.6959474
SVRVLNPNAE,nta,S,2,false,"HUNTER N-terminome: legumain, GluC and trypsin",119,31951383,"MaxQuant score",41.5750000,,,,,,
GLQDVLKSNLGPK,ac,K,34,false,"Quantitative Acetylproteomics",101,29440448,,,,,,,,
MLVGGSGDIK,mox,M,45,false,"cat2 Methionine oxidation - 3h stress",62b,25693801,"MASCOT Score",54.0000000,,-0.0365264,,NO,,
CIDEGMHPR,so,C,108,false,"Arabidopsis S-sulfenylation chemoproteomics",108,31578252,"pFind PSM Score",0.1249270,,2.0408200,,,,-1.8223297
CIDEGMHPR,so,C,108,false,"S-sulfenylation site detection using YAP1C",110,32714340,,,,,,,,
IDEGMHPR,nt,I,109,false,"Arg/N-end rule seed, prt6 vs. Wt",99,29168982,"MASCOT Score",45.5800000,,-0.4935552,0.1486449,NO,0.064290001988411,-0.5932195
VLVDGFEIAKR,ac,K,126,false,"Quantitative Acetylproteomics",101,29440448,,,,,,,,
VLVDGFEIAKR,ub,K,126,false,"Arabidopsis ubiquitination COFRADIC",40,26744219,"MaxQuant Score",60.2550000,1.0000000,,,,0.0049999998882413,1.0810000
HKFDVDTR,ac,K,202,false,"Quantitative Acetylproteomics",101,29440448,,,,,,,,
AENCHILTCNVSLEYEK,so,C,231,false,"Arabidopsis S-sulfenylation chemoproteomics",108,31578252,"pFind PSM Score",0.0005493,,,,,,-0.7570497
VCGDNDNFVVINQK,sno,C,285,true,"Site-specific nitrosomeproteomic id - gsnor1-3",90a,25699590,XCorr,3.8650479,,,,,0.1494999974966,-5.9643820
VCGDNDNFVVINQK,sno,C,285,true,"hot5-4 / wildtype, FAT-switch S-nitrosoproteome",169,37277371,,,,0.3500353,0.0329200,NO,,
VCGDNDNFVVINQK,so,C,285,true,"S-sulfenylation site detection using YAP1C",110,32714340,,,,,,,,
NPNSCTILIK,ox,C,374,true,"SPEAR - 10 mM H2O2 / mock",138a,34619326,,,,4.5416403,0.0006928,YES,,
NPNSCTILIK,ox,C,374,true,"SPEAR - 50 mM H2O2 / mock",138b,34619326,,,,5.7367605,0.0301614,YES,,
NPNSCTILIK,so,C,374,true,"S-sulfenylation site detection using YAP1C",110,32714340,,,,,,,,
GPNDHTIAQIKDAVR,ac,K,390,false,"Histone deacetylases substrates - TSA vs control",98b,29061669,"MaxQuant Score",55.8000000,1.0000000,0.1650000,0.9977001,NO,0.00067999999737367,
NTIEDECVVLGAGAFEVAAR,acy,C,408,true,"Arabidopsis S-acylation atlas - Stem",163f,35681017,,,,,,,,
NTIEDECVVLGAGAFEVAAR,so,C,408,true,"S-sulfenylation site detection using YAP1C",110,32714340,,,,,,,,
VVLGAGAFEVAAR,nt,V,409,false,"Arg/N-end rule seed, prt6 vs. Wt",99,29168982,"MASCOT Score",68.7800000,,0.2896297,0.5937920,NO,0.0030390000902116,-0.2476031
ALLVVPKTLAENAGL,nt,A,446,false,"Arabidopsis translation initiation landscape - NT",167b,35069635,,,,,,,,
ALLVVPKTLAE,nt,A,446,false,"Arg/N-end rule seed, prt6 vs. Wt",99,29168982,"MASCOT Score",35.1300000,,-0.3754738,0.3720806,NO,6.6469998273533E-5,-1.7405591
