Peptide,PTM,ModifiedAA,ModifiedPosition,PeptideUniqueToGene,ExperimentDesc,ExpID,PubmedID,ScoreType,IdentScore,LocProb,Log2FChange,PQ-val,QuantSig,PEP,MassErrorPPM
SSDSSREENV,nt,S,2,true,"N-term acetylation drought responses",5,26184543,,,,,,,,
SSDSSREENVYLAKLAEQAER,nta,S,2,true,"Arg/N-end rule pathway Roots",80,25728785,"MASCOT Score",33.2800000,,,,,0.0088849999010563,
SSDSSREENVYLAKLAEQAER,nta,S,2,true,"Arabidopsis translation initiation landscape - NTA",167a,35069635,,,,,,,,
SSDSSREENV,nta,S,2,true,"N-term acetylation drought responses",5,26184543,,,,,,,,
SSDSSREENVYLAK,ph,S,2,true,"Arabidopsis root NAA phosphoproteome",18a,27643528,"MaxQuant Score",57.5250000,0.8610000,,,,3.2830001146067E-5,-0.3770000
SSDSSREENVYLAK,ph,S,2,true,"atm and atr DNA damage response",88,25561503,"MASCOT Score",31.0000000,1.0000000,,,,,1.6900000
SSDSSREENVYLAK,ph,S,2,true,"Phospho cell culture sucrose/TOR",109,30833711,,,0.9337240,,,,,
SSDSSREENVYLAK,ph,S,2,true,"Tissue atlas Arabidopsis - ProteomicsDB",114,32188942,"MaxQuant score",177.7400000,0.9500460,,,,2.8613599104887E-19,
SSDSSREENVYLAK,ph,S,3,true,"atm and atr DNA damage response",88,25561503,"MASCOT Score",31.0000000,1.0000000,,,,,1.6900000
SSDSSREENVYLAK,ph,S,3,true,"Protein sumoylation and phosphorylation cross-talk",97,28419593,,,,,,,,
SSDSSREENVYLAK,ph,S,3,true,"Tissue atlas Arabidopsis - ProteomicsDB",114,32188942,"MaxQuant score",158.2900000,0.7901810,,,,9.4116901772079E-13,
SSDSSREENVYLAK,ph,S,5,true,"Tissue atlas Arabidopsis - ProteomicsDB",114,32188942,"MaxQuant score",79.6520000,0.7681930,,,,0.00010880800255109,
NLLSVAYK,ph,S,51,false,"atm and atr DNA damage response",88,25561503,"MASCOT Score",39.0000000,1.0000000,,,,,-1.2400000
VAYKNVIGAR,nt,V,52,false,"Arabidopsis translation initiation landscape - NT",167b,35069635,,,,,,,,
NLLSVAYKNVIGAR,ub,K,55,false,"Ubiquitination Membrane Proteins",120,33585938,,,,,,,,
NLLSVAYKNVIGAR,ub,K,55,false,"upl3 mutant / wildtype",168,35926874,"MaxQuant score",170.0000000,1.0000000,0.5616927,0.4645800,NO,6.5853397047453E-17,-0.1572200
IISSIEQKEDSR,ub,K,74,true,"upl3 mutant / wildtype",168,35926874,"MaxQuant score",75.0880000,1.0000000,0.2856981,0.6371200,NO,0.00027870401390828,-0.6971200
GNSDHVSIIKDYR,ac,K,88,true,"Quantitative Acetylproteomics",101,29440448,,,,,,,,
SKVFYLKMKGDYHRYLAE,nt,S,122,false,"Arabidopsis translation initiation landscape - NT",167b,35069635,,,,,,,,
LKMKGDYHRYLAE,nt,L,127,false,"Arabidopsis translation initiation landscape - NT",167b,35069635,,,,,,,,
VFYLKMK,ac,K,128,false,"Quantitative Acetylproteomics",101,29440448,,,,,,,,
YLAEFKTGAER,ac,K,141,false,"Quantitative Acetylproteomics",101,29440448,,,,,,,,
KEAAESTLVAYK,ub,K,147,false,"upl3 mutant / wildtype",168,35926874,"MaxQuant score",125.5300000,1.0000000,0.5439907,0.3374400,NO,1.4724900211149E-5,1.3224000
STLVAYK,nt,S,152,false,"Arg/N-end rule seed, prt6 vs. Wt",99,29168982,"MASCOT Score",21.1000000,,-0.0873289,0.4389741,NO,0.0052269999869168,-0.7113890
ACSLAK,sno,C,197,false,"hot5-4 / wildtype, FAT-switch S-nitrosoproteome",169,37277371,,,,,,,,
QAFDEAISELDTLGEESYK,ph,S,209,false,"Phospho cell culture sucrose/TOR",109,30833711,,,0.8902370,,,,,
DNLTLWTSDLNDEAGDDIK,ph,S,238,true,"Large-scale phosphorylation discovery",44,23111157,XCorr,6.2700000,,,,,,
DNLTLWTSDLNDEAGDDIK,ph,S,238,true,"srk2dei ABA signaling phopshoproteomics",83,23572148,"MASCOT Score",95.0000000,,,,,,0.0031000
DNLTLWTSDLNDEAGDDIK,ph,S,238,true,"TOR Kinase and ABA Receptor",100,29290610,XCorr,4.6624069,0.9912000,,,,4.0920000174083E-5,
DNLTLWTSDLNDEAGDDIKEAPK,ub,K,249,true,"upl3 mutant / wildtype",168,35926874,"MaxQuant score",177.0300000,1.0000000,0.1724875,0.8849000,NO,1.9163899959189E-38,0.2970000
EVQKVDEQAQPPPSQ,nt,E,254,true,"Metacaspase9 substrates - Col-0 / mc9",51a,23964026,"MASCOT Score",59.0000000,,4.1514354,,NO,,-2.2442009
EVQKVDEQAQPPPSQ,nt,E,254,true,"Metacaspase9 substrates - 35S:MC9 / mc9",51b,23964026,"MASCOT Score",48.0000000,,,,,,-2.1894644
EVQKVDEQAQPPPSQ,nt,E,254,true,"Metacaspase9 substrates - in vitro rMC9",51c,23964026,"MASCOT Score",75.0000000,,,,,,-0.6047608
KVDEQAQPPPSQ,nt,K,257,true,"Metacaspase9 substrates - in vitro rMC9",51c,23964026,"MASCOT Score",49.0000000,,1.9288895,,NO,,-0.5469221
EVQKVDEQAQPPPSQ,ub,K,257,true,"upl3 mutant / wildtype",168,35926874,"MaxQuant score",87.8240000,1.0000000,0.3640121,0.5920000,NO,1.4145600289339E-5,-0.4655500
EVQKVDEQAQPPPSQ,ph,S,267,true,"STN8 phosphoproteome",38,21768351,"MASCOT Score",72.5100000,,,,,,-0.9344530
EVQKVDEQAQPPPSQ,ph,S,267,true,"Chloroplast kinase substrates",60,19376835,"MASCOT Score",66.2200000,,,,,,-1.5137400
EVQKVDEQAQPPPSQ,ph,S,267,true,"SnRK2 protein kinase substrates",85,23776212,XCorr,2.7808285,1.0000000,,,,0.0059452401474118,
EVQKVDEQAQPPPSQ,ph,S,267,true,"Col-0 callus - FC Col-0 vs. Col-0 Xray",111a,31410901,,40.8300000,,0.6659923,0.0000000,NO,,0.3554131
EVQKVDEQAQPPPSQ,ph,S,267,true,"Col-0 X-ray callus - FC Col-0 vs. Col-0 Xray",111b,31410901,,40.8300000,,0.6659923,0.0000000,NO,,0.3554131
EVQKVDEQAQPPPSQ,ph,S,267,true,"atm callus - FC atm vs. atm Xray",111c,31410901,,40.8300000,,-0.3301473,0.0000000,NO,,0.3554131
EVQKVDEQAQPPPSQ,ph,S,267,true,"atm-3 X-ray callus - FC atm vs. atm Xray",111d,31410901,,40.8300000,,-0.3301473,0.0000000,NO,,0.3554131
VDEQAQPPPSQ,ph,S,267,true,"atm and atr DNA damage response",88,25561503,"MASCOT Score",43.0000000,1.0000000,,,,,0.1400000
VDEQAQPPPSQ,ph,S,267,true,"TOR Kinase and ABA Receptor",100,29290610,XCorr,2.1969626,1.0000000,,,,0.014600000344217,
VDEQAQPPPSQ,ph,S,267,true,"Lateral root-induction - NAA vs control",106,23328941,"MASCOT Score",27.0000000,,,,,,
VDEQAQPPPSQ,ph,S,267,true,"Tissue atlas Arabidopsis - ProteomicsDB",114,32188942,"MaxQuant score",205.4500000,1.0000000,,,,8.4077907859489E-45,
