Peptide,PTM,ModifiedAA,ModifiedPosition,PeptideUniqueToGene,ExperimentDesc,ExpID,PubmedID,ScoreType,IdentScore,LocProb,Log2FChange,PQ-val,QuantSig,PEP,MassErrorPPM
RFSASYIGSFR,ph,S,33,true,"atm and atr DNA damage response",88,25561503,"MASCOT Score",24.0000000,1.0000000,,,,,0.1000000
RFSASYIGSFR,ph,S,33,true,"Tissue atlas Arabidopsis - ProteomicsDB",114,32188942,"MaxQuant score",97.7670000,0.9992120,,,,7.6400800026022E-5,
RFSASYIGSFR,ph,S,33,true,"Touch-induced phosphorylation: 40s touch vs untouc",136,30291188,"MASCOT score",62.2600000,,-0.2173965,0.0000314,NO,,3.8992491
RFSASYIGSFR,ph,S,39,true,"atm and atr DNA damage response",88,25561503,"MASCOT Score",24.0000000,1.0000000,,,,,0.1000000
FSASYIGSFR,ph,S,39,true,"Chloroplast kinase substrates",60,19376835,"MASCOT Score",43.9900000,,,,,,0.9260290
FSASYIGSFR,ph,S,39,true,"atm and atr DNA damage response",88,25561503,"MASCOT Score",49.0000000,1.0000000,,,,,-0.0900000
FSASYIGSFR,ph,S,39,true,"Tissue atlas Arabidopsis - ProteomicsDB",114,32188942,"MaxQuant score",169.9800000,0.9999840,,,,1.8313400573788E-7,
TTNFNNISSTASSPGYTLK,ph,S,62,true,"TOR Kinase and ABA Receptor",100,29290610,XCorr,3.2166858,0.8306000,,,,0.0012219999916852,
TTNFNNISSTASSPGYTLK,ph,S,63,true,"TOR Kinase and ABA Receptor",100,29290610,XCorr,3.6499498,0.8748000,,,,1.2499999684223E-5,
TTNFNNISSTASSPGYTLK,ph,S,63,true,"Tissue atlas Arabidopsis - ProteomicsDB",114,32188942,"MaxQuant score",259.3400000,0.8996590,,,,0,
QDMSNEEDEEEEEEEK,ph,S,268,true,"TOR Kinase and ABA Receptor",100,29290610,XCorr,4.0807061,1.0000000,,,,3.1619998708265E-7,
QDMSEEDDKEEEDEQEEEEK,ph,S,284,true,"TOR Kinase and ABA Receptor",100,29290610,XCorr,4.2030792,1.0000000,,,,6.0349998420861E-6,
