Peptide,PTM,ModifiedAA,ModifiedPosition,PeptideUniqueToGene,ExperimentDesc,ExpID,PubmedID,ScoreType,IdentScore,LocProb,Log2FChange,PQ-val,QuantSig,PEP,MassErrorPPM
MDIDGEDVSR,nta,M,1,true,"N-term acetylation drought responses",5,26184543,,,,,,,,
MDIDGEDVSR,nta,M,1,true,"Characterization plant N-terminal acetylation",6,22223895,"MASCOT Score",55.6700000,,,,,,
MDIDGEDVSR,nta,M,1,true,"Arg/N-end rule pathway Roots",80,25728785,"MASCOT Score",26.3200000,,,,,0.0044519999064505,
MDIDGEDVSR,nta,M,1,true,"Arabidopsis translation initiation landscape - NTA",167a,35069635,,,,,,,,
LDSPFKVPVNSVAIPSNVTR,ph,S,22,true,"Tissue atlas Arabidopsis - ProteomicsDB",114,32188942,"MaxQuant score",199.2800000,1.0000000,,,,0,
KEEEPSLHDDWVSAVNGSSPR,ph,S,120,true,"Tissue atlas Arabidopsis - ProteomicsDB",114,32188942,"MaxQuant score",172.0000000,0.8473840,,,,7.3671000021481E-37,
ASVQSVSAQK,ph,S,212,true,"Tissue atlas Arabidopsis - ProteomicsDB",114,32188942,"MaxQuant score",82.7740000,0.8177400,,,,0.00236363010481,
SVSVKKRKGNNQAEE,nt,S,243,true,"Arabidopsis translation initiation landscape - NT",167b,35069635,,,,,,,,
DSLNLFCGK,so,C,311,true,"Arabidopsis S-sulfenylation chemoproteomics",108,31578252,"pFind PSM Score",0.0184672,,1.0363000,,,,-1.0882484
