Peptide,PTM,ModifiedAA,ModifiedPosition,PeptideUniqueToGene,ExperimentDesc,ExpID,PubmedID,ScoreType,IdentScore,LocProb,Log2FChange,PQ-val,QuantSig,PEP,MassErrorPPM
ATGKTVKDVSPHDFVKAY,nt,A,2,false,"Arg/N-end rule pathway Roots",80,25728785,"MASCOT Score",40.7900000,,,,,6.623999979638E-7,
ATGKTVKDVSPH,nt,A,2,false,"Arg/N-end rule seed, prt6 vs. Wt",99,29168982,"MASCOT Score",34.6200000,,,,,0.0039029999170452,-0.4272029
ATGKTVKDVS,nt,A,2,false,"N-term acetylation drought responses",5,26184543,,,,,,,,
ATGKTVKDVSPHDFVKAYASHLKR,nta,A,2,false,"Arg/N-end rule pathway Roots",80,25728785,"MASCOT Score",34.1800000,,,,,7.3859999247361E-5,
ATGKTVKDVSPHDFVKAY,nta,A,2,false,"Arg/N-end rule pathway Roots",80,25728785,"MASCOT Score",76.0800000,,,,,3.4659998959796E-7,
ATGKTVKDVSPHDFVKAY,nta,A,2,false,"Arabidopsis translation initiation landscape - NTA",167a,35069635,,,,,,,,
ATGKTVKDVSPH,nta,A,2,false,"Arg/N-end rule seed, prt6 vs. Wt",99,29168982,"MASCOT Score",34.6200000,,,,,0.0039029999170452,-0.4272029
ATGKTVKDVS,nta,A,2,false,"N-term acetylation drought responses",5,26184543,,,,,,,,
ATGKTVK,ac,K,5,false,"Quantitative Acetylproteomics",101,29440448,,,,,,,,
DVSPHDFVK,ph,S,11,false,"atm and atr DNA damage response",88,25561503,"MASCOT Score",23.0000000,1.0000000,,,,,-0.6100000
DVSPHDFVK,ph,S,11,false,"Tissue atlas Arabidopsis - ProteomicsDB",114,32188942,"MaxQuant score",80.9160000,1.0000000,,,,0.0043183700181544,
SHLKRSGKIE,nt,S,21,false,"Arabidopsis translation initiation landscape - NT",167b,35069635,,,,,,,,
DVSPHDFVKAYASHLKR,ph,S,21,false,"SIRK1 phosphorylation",86a,23820729,"MaxQuant Score",79.7260000,0.8180000,,,,0.99599999189377,5.8420000
AYASHLKR,ac,K,24,false,"Quantitative Acetylproteomics",101,29440448,,,,,,,,
GGLGVGAFR,nt,G,69,false,"Arg/N-end rule seed, prt6 vs. Wt",99,29168982,"MASCOT Score",52.8300000,,,,,0.045880001038313,-0.4814121
GGLGVGAFR,nt,G,69,false,"Arabidopsis translation initiation landscape - NT",167b,35069635,,,,,,,,
IYGGSKR,ub,K,84,false,"Arabidopsis ubiquitination COFRADIC",40,26744219,"MaxQuant Score",121.2900000,1.0000000,,,,0.0080000003799796,-0.5340000
NGSRPPHFCK,so,C,94,false,"S-sulfenylation site detection using YAP1C",110,32714340,,,,,,,,
DLDQVAGR,nt,D,131,false,"Metacaspase9 substrates - Col-0 / mc9",51a,23964026,"MASCOT Score",48.0000000,,2.5571563,,NO,,-0.1056535
