Peptide,PTM,ModifiedAA,ModifiedPosition,PeptideUniqueToGene,ExperimentDesc,ExpID,PubmedID,ScoreType,IdentScore,LocProb,Log2FChange,PQ-val,QuantSig,PEP,MassErrorPPM
EASSSNGRLTQQE,nt,E,69,true,"N-terminal ChaFRADIC",92,26010716,"MASCOT Score",20.4500000,,,,,4.3359999835957E-5,
CIQILSR,so,C,266,true,"S-sulfenylation site detection using YAP1C",110,32714340,,,,,,,,
KLISLDMGALIAGAKYR,ub,K,326,true,"Arabidopsis ubiquitination by TUBEs",2,23667124,,,,,,,,
CIGATTLDEYRK,so,C,386,false,"Arabidopsis S-sulfenylation chemoproteomics",108,31578252,"pFind PSM Score",0.3399780,,,,,,-0.8401352
CIGATTLDEYRK,so,C,386,false,"S-sulfenylation site detection using YAP1C",110,32714340,,,,,,,,
IGATTLDE,nt,I,387,false,"Arg/N-end rule seed, prt6 vs. Wt",99,29168982,"MASCOT Score",47.7400000,,-0.1083468,0.5957938,NO,0.022520000115037,0.0209752
LSLTNDTDKASR,ub,K,511,true,"Arabidopsis ubiquitination COFRADIC",40,26744219,"MaxQuant Score",54.3430000,1.0000000,,,,0.00067530001979321,0.3890000
AAELKYGSLNSLQR,ub,K,578,true,"Arabidopsis ubiquitination COFRADIC",40,26744219,"MaxQuant Score",62.2870000,1.0000000,,,,7.0729998697061E-5,0.0910000
