Peptide,PTM,ModifiedAA,ModifiedPosition,PeptideUniqueToGene,ExperimentDesc,ExpID,PubmedID,ScoreType,IdentScore,LocProb,Log2FChange,PQ-val,QuantSig,PEP,MassErrorPPM
YTVGENKFWNPNINYTIWAQGK,ng,N,42,true,"Conserved N-glycosylation",74,22633491,"MaxQuant Score",207.3200000,0.9980000,,,,0,0.5930000
FWNPNINYTIWAQGK,ng,N,42,true,"N-glycan occupancy Arabidopsis glycoproteins",87,23994444,"Ladder score",62.1000000,,,,,,
FWNPNINYTIWAQGK,ng,N,42,true,"UDP-GlcNAc transporter glycopeptide analysis",135,30224661,,,,,,,3.8543696234683E-8,-0.4000000
NQHNILEVNKTDYEGCIADHPIRNWTR,ng,N,73,true,"Conserved N-glycosylation",74,22633491,"MaxQuant Score",263.9000000,1.0000000,,,,0,0.8360000
NQHNILEVNKTDYEGCIADHPIR,ng,N,73,true,"UDP-GlcNAc transporter glycopeptide analysis",135,30224661,,,,,,,1.1500366902274E-13,1.1000000
NQHNILEVNK,ng,N,73,true,"N-linked Glycan Micro-heterogeneity Arabidopsis",134,29237727,,,,,,,,
NQHNILEVNK,ng,N,73,true,"UDP-GlcNAc transporter glycopeptide analysis",135,30224661,,,,,,,5.3185171544623E-11,0.3000000
TDYEGCIADHPIR,ph,T,75,true,"Phosphorylation in N starvation",63,22060019,"MASCOT Score",99.0000000,,,,,,7.3362200
TDYEGCIADHPIR,sno,C,80,true,"hot5-4 / wildtype, FAT-switch S-nitrosoproteome",169,37277371,,,,,,,,
NQHNILEVNKTDYEGCIADHPIRNWTR,ng,N,88,true,"Conserved N-glycosylation",74,22633491,"MaxQuant Score",263.9000000,1.0000000,,,,0,0.8360000
TDYEGCIADHPIRNWTR,ng,N,88,true,"Conserved N-glycosylation",74,22633491,"MaxQuant Score",181.0900000,1.0000000,,,,0,-0.7230000
GAGRDIVTLNQTKHYYLLDGK,ng,N,101,true,"Conserved N-glycosylation",74,22633491,"MaxQuant Score",188.4300000,1.0000000,,,,1.1679999865886E-31,-0.0690000
DIVTLNQTK,ng,N,101,true,"N-glycan occupancy Arabidopsis glycoproteins",87,23994444,"Ladder score",68.6000000,,,,,,
DIVTLNQTK,ng,N,101,true,"N-linked Glycan Micro-heterogeneity Arabidopsis",134,29237727,,,,,,,,
DIVTLNQTK,ng,N,101,true,"UDP-GlcNAc transporter glycopeptide analysis",135,30224661,,,,,,,2.4730547920626E-7,0.5000000
GGCYGGMK,ox,C,115,false,"OxiTRAQ Arabidopsis - 5 mM H2O2 versus control",47,24376095,,,,-0.2104970,0.0747798,NO,,
GGCYGGMK,ox,C,115,false,"Bicarbonate Induced Redox Changes - 30 min",117b,28184230,,,,0.6507646,,YES,,
GGCYGGMK,sno,C,115,false,"hot5-4 / wildtype, FAT-switch S-nitrosoproteome",169,37277371,,,,-0.6295511,0.0151476,YES,,
