Peptide,PTM,ModifiedAA,ModifiedPosition,PeptideUniqueToGene,ExperimentDesc,ExpID,PubmedID,ScoreType,IdentScore,LocProb,Log2FChange,PQ-val,QuantSig,PEP,MassErrorPPM
VHVCYYRNYG,nt,V,2,true,"N-term acetylation drought responses",5,26184543,,,,,,,,
VHVCYYRNYG,nt,V,2,true,"Arg/N-end rule seed, prt6 vs. Wt",99,29168982,"MASCOT Score",23.3600000,,-0.1573005,0.5543508,NO,0.0020139999687672,0.3593149
VHVCYYR,nt,V,2,true,"Arg/N-end rule pathway Roots",80,25728785,"MASCOT Score",25.5000000,,,,,0.093149997293949,
VHVCYYR,nt,V,2,true,"N-terminal ChaFRADIC",92,26010716,"MASCOT Score",24.4700000,,,,,0.012989999726415,
VHVCYYR,nt,V,2,true,"Arg/N-end rule seed, prt6 vs. Wt",99,29168982,"MASCOT Score",25.0700000,,0.2519583,0.3251528,NO,0.053789999336004,-0.1620041
VHVCYYR,nt,V,2,true,"Arabidopsis translation initiation landscape - NT",167b,35069635,,,,,,,,
VHVCYYR,so,C,5,true,"S-sulfenylation site detection using YAP1C",110,32714340,,,,,,,,
YGKTFKGPR,nt,Y,10,true,"Metacaspase9 substrates - Col-0 / mc9",51a,23964026,"MASCOT Score",50.0000000,,1.0808204,,NO,,-0.6275773
NYGKTFKGPR,ac,K,12,true,"Quantitative Acetylproteomics",101,29440448,,,,,,,,
NYGKTFK,ac,K,12,false,"Quantitative Acetylproteomics",101,29440448,,,,,,,,
RPYEKER,ac,K,23,false,"Quantitative Acetylproteomics",101,29440448,,,,,,,,
DLLTLDEKSPR,ac,K,67,true,"Histone deacetylases - apicidin vs control",98a,29061669,"MaxQuant Score",71.2000000,1.0000000,-0.2320000,0.4487454,NO,2.3000000510365E-5,
DLLTLDEKSPR,ac,K,67,true,"Histone deacetylases substrates - hda14 vs WT",98e,29061669,"MaxQuant Score",54.3000000,1.0000000,-0.0220000,0.9705100,NO,0.0040000001899898,
DLLTLDEKSPR,ub,K,67,true,"Arabidopsis ubiquitination COFRADIC",40,26744219,"MaxQuant Score",96.2290000,1.0000000,,,,6.4060000113386E-6,0.5480000
DLLTLDEKSPR,ub,K,67,true,"upl3 mutant / wildtype",168,35926874,"MaxQuant score",149.9600000,1.0000000,-0.0709665,0.7953800,NO,1.004220040457E-9,1.5158000
DLLTLDEKSPR,ph,S,68,true,"Arabidopsis root NAA phosphoproteome",18a,27643528,"MaxQuant Score",106.3200000,1.0000000,,,,7.0720000167057E-7,0.5020000
DLLTLDEKSPR,ph,S,68,true,"Phosphoproteome ethylene-regulated time response",46,24043427,"MASCOT Score",53.2400000,,,,,,11.5111000
DLLTLDEKSPR,ph,S,68,true,"Tyrosine phosphorylation in Arabidopsis",59,18463617,"MASCOT Score",27.0000000,,,,,,-0.7322503
DLLTLDEKSPR,ph,S,68,true,"Chloroplast kinase substrates",60,19376835,"MASCOT Score",45.3900000,,,,,,-1.1226300
DLLTLDEKSPR,ph,S,68,true,"srk2dei ABA signaling phopshoproteomics",83,23572148,"MASCOT Score",54.0000000,,,,,,-0.0001000
DLLTLDEKSPR,ph,S,68,true,"SnRK2 protein kinase substrates",85,23776212,XCorr,2.9687467,1.0000000,,,,0.015422400087118,
DLLTLDEKSPR,ph,S,68,true,"atm and atr DNA damage response",88,25561503,"MASCOT Score",56.0000000,1.0000000,,,,,-0.2500000
DLLTLDEKSPR,ph,S,68,true,"Phospho cell culture sucrose/TOR",109,30833711,,,1.0000000,,,,,
DLLTLDEKSPR,ph,S,68,true,"Col-0 callus - FC Col-0 vs. Col-0 Xray",111a,31410901,,44.5000000,,0.5451617,0.0000000,NO,,0.4438836
DLLTLDEKSPR,ph,S,68,true,"Col-0 X-ray callus - FC Col-0 vs. Col-0 Xray",111b,31410901,,44.5000000,,0.5451617,0.0000000,NO,,0.4438836
DLLTLDEKSPR,ph,S,68,true,"atm callus - FC atm vs. atm Xray",111c,31410901,,44.5000000,,-0.2003373,0.0000000,NO,,0.4438836
DLLTLDEKSPR,ph,S,68,true,"atm-3 X-ray callus - FC atm vs. atm Xray",111d,31410901,,44.5000000,,-0.2003373,0.0000000,NO,,0.4438836
DLLTLDEKSPR,ph,S,68,true,"Tissue atlas Arabidopsis - ProteomicsDB",114,32188942,"MaxQuant score",245.5000000,1.0000000,,,,0,
VENFLER,nt,V,103,false,"Arg/N-end rule seed, prt6 vs. Wt",99,29168982,"MASCOT Score",33.8600000,,-0.8435995,0.0112550,NO,0.17010000348091,-0.6681296
LQTIVFKSGMAK,ac,K,117,false,"Quantitative Acetylproteomics",101,29440448,,,,,,,,
QLVNIPSFMVR,ph,S,147,false,"TOR Kinase and ABA Receptor",100,29290610,XCorr,3.0595963,1.0000000,,,,0.0018870000494644,
LDSQKHIDFALTSPFGGGRPGR,ph,S,154,true,"Arabidopsis root NAA phosphoproteome",18a,27643528,"MaxQuant Score",106.1200000,1.0000000,,,,1.0149999872706E-13,0.0970000
LDSQKHIDFALTSPFGGGRPGR,ph,S,154,true,"Tissue atlas Arabidopsis - ProteomicsDB",114,32188942,"MaxQuant score",201.1700000,1.0000000,,,,0,
LDSQKHIDFALTSPFGGGRPGR,ac,K,156,true,"Histone deacetylases- hda14 vs WT (low light)",98c,29061669,"MaxQuant Score",72.9400000,1.0000000,0.0940000,0.9885531,NO,0.00036000000545755,
LDSQKHIDFALTSPFGGGR,ac,K,156,true,"Histone deacetylases - apicidin vs control",98a,29061669,"MaxQuant Score",111.6000000,1.0000000,-0.1560000,0.3548134,NO,1.2000000341586E-37,
LDSQKHIDFALTSPFGGGR,ac,K,156,true,"Histone deacetylases substrates - hda14 vs WT",98e,29061669,"MaxQuant Score",58.8000000,1.0000000,1.8500000,0.8016781,NO,1.2999999853491E-5,
HIDFALTSPFGGGRPGR,ph,S,164,true,"Tissue atlas Arabidopsis - ProteomicsDB",114,32188942,"MaxQuant score",159.9500000,0.9709670,,,,5.2492600431207E-17,
KASGGGDADGDDEE,ph,S,187,true,"Large-scale phosphorylation discovery",44,23111157,XCorr,2.6890000,,,,,,
KASGGGDADGDDEE,ph,S,187,true,"SnRK2 protein kinase substrates",85,23776212,XCorr,4.2932372,1.0000000,,,,0.00029785800143145,
KASGGGDADGDDEE,ph,S,187,true,"atm and atr DNA damage response",88,25561503,"MASCOT Score",51.0000000,1.0000000,,,,,-0.4500000
