Peptide,PTM,ModifiedAA,ModifiedPosition,PeptideUniqueToGene,ExperimentDesc,ExpID,PubmedID,ScoreType,IdentScore,LocProb,Log2FChange,PQ-val,QuantSig,PEP,MassErrorPPM
MDLERLSPR,ph,S,7,true,"atm and atr DNA damage response",88,25561503,"MASCOT Score",37.0000000,1.0000000,,,,,-0.1200000
MDLERLSPR,ph,S,7,true,"Tissue atlas Arabidopsis - ProteomicsDB",114,32188942,"MaxQuant score",140.6300000,1.0000000,,,,1.6701300410205E-5,
LKVPGWSLK,ub,K,135,true,"upl3 mutant / wildtype",168,35926874,"MaxQuant score",67.3340000,1.0000000,0.6526012,,,0.010953100398183,0.1030300
SDKPLNYSPDPENESGINER,ph,S,637,true,"atm and atr DNA damage response",88,25561503,"MASCOT Score",71.0000000,1.0000000,,,,,0.2900000
SDKPLNYSPDPENESGINER,ph,S,637,true,"Tissue atlas Arabidopsis - ProteomicsDB",114,32188942,"MaxQuant score",309.1200000,1.0000000,,,,0,
SDKPLNYSPDPENESGINER,ph,S,637,true,"Touch-induced phosphorylation: 40s touch vs untouc",136,30291188,"MASCOT score",95.9300000,,-0.0531019,0.5379632,NO,,0.9903376
QEPSSSSEVIMVAPSPR,ph,S,688,true,"TOR Kinase and ABA Receptor",100,29290610,XCorr,3.8471284,0.9997000,,,,0.0029029999859631,
QEPSSSSEVIMVAPSPR,ph,S,688,true,"Tissue atlas Arabidopsis - ProteomicsDB",114,32188942,"MaxQuant score",151.2800000,1.0000000,,,,3.1492099509742E-13,
FVLPESAR,ph,S,702,true,"Tissue atlas Arabidopsis - ProteomicsDB",114,32188942,"MaxQuant score",73.8410000,1.0000000,,,,0.011645499616861,
