Peptide,PTM,ModifiedAA,ModifiedPosition,PeptideUniqueToGene,ExperimentDesc,ExpID,PubmedID,ScoreType,IdentScore,LocProb,Log2FChange,PQ-val,QuantSig,PEP,MassErrorPPM
MEILPIPAESFKVGFIGAGKMAESIAR,nta,M,1,true,"Arabidopsis translation initiation landscape - NTA",167a,35069635,,,,,,,,
MEILPIPAESFK,nta,M,1,true,"Characterization plant N-terminal acetylation",6,22223895,"MASCOT Score",50.7300000,,,,,,
MEILPIPAESF,nta,M,1,true,"Arg/N-end rule pathway Roots",80,25728785,"MASCOT Score",68.9200000,,,,,0.0003228000132367,
MEILPIPAESF,nta,M,1,true,"Arg/N-end rule seed, prt6 vs. Wt",99,29168982,"MASCOT Score",32.7300000,,,,,0.097669996321201,-2.4354758
MEILPIPAESFK,ph,S,10,true,"TOR Kinase and ABA Receptor",100,29290610,XCorr,2.8141370,1.0000000,,,,0.0019130000146106,
ICTAVHSNLNR,ox,C,41,true,"SPEAR - 10 mM H2O2 / mock",138a,34619326,,,,0.5474837,0.0029707,YES,,
ICTAVHSNLNR,ox,C,41,true,"SPEAR - 50 mM H2O2 / mock",138b,34619326,,,,0.5388609,0.0231606,YES,,
ICTAVHSNLNR,so,C,41,true,"Arabidopsis S-sulfenylation chemoproteomics",108,31578252,"pFind PSM Score",0.0467845,,1.2195100,,,,-1.5044768
AVTELKSK,ac,K,92,true,"Quantitative Acetylproteomics",101,29440448,,,,,,,,
ALADGGVAAGLPR,nt,A,192,true,"Arg/N-end rule seed, prt6 vs. Wt",99,29168982,"MASCOT Score",75.6000000,,-0.9197102,0.0068156,NO,7.6789998274762E-5,2.2861187
DDVTSPGGTTIAGVHELEK,ph,S,238,true,"srk2dei ABA signaling phopshoproteomics",83,23572148,"MASCOT Score",37.0000000,,,,,,-0.0044000
DDVTSPGGTTIAGVHELEK,ph,S,238,true,"TOR Kinase and ABA Receptor",100,29290610,XCorr,4.3247743,0.9913000,,,,2.9069999527565E-6,
DDVTSPGGTTIAGVHELEK,ph,S,238,true,"Phospho cell culture sucrose/TOR",109,30833711,,,0.9957900,,,,,
DDVTSPGGTTIAGVHELEK,ph,S,238,true,"Tissue atlas Arabidopsis - ProteomicsDB",114,32188942,"MaxQuant score",155.1100000,0.9980860,,,,6.0011499056841E-22,
