Peptide,PTM,ModifiedAA,ModifiedPosition,PeptideUniqueToGene,ExperimentDesc,ExpID,PubmedID,ScoreType,IdentScore,LocProb,Log2FChange,PQ-val,QuantSig,PEP,MassErrorPPM
TRVYVSLFHTLFR,ph,T,56,true,"SIRK1 phosphorylation",86a,23820729,"MaxQuant Score",111.0200000,0.9950000,,,,0.071000002324581,6.6120000
TRVYVSLFHTLFR,ph,T,56,true,"SIRK1 exp - sirk1 mutant vs WT",86b,23820729,,,,-0.5670623,,NO,,
TRVYVSLFHTLFR,ph,T,56,true,"SIRK1 exp - 35S:SIRK1 vs WT",86c,23820729,,,,0.0259895,,NO,,
RFDPDLAPIKTR,ph,T,56,true,"SIRK1 phosphorylation",86a,23820729,"MaxQuant Score",99.3830000,1.0000000,,,,0.10999999940395,2.2590000
RFDPDLAPIKTR,ph,T,56,true,"SIRK1 exp - sirk1 mutant vs WT",86b,23820729,,,,1.2985502,,NO,,
RFDPDLAPIKTR,ph,T,56,true,"SIRK1 exp - 35S:SIRK1 vs WT",86c,23820729,,,,-1.4332839,,NO,,
TRVYVSLFHTLFRLYLSCER,ph,S,61,true,"srk2dei ABA signaling phopshoproteomics",83,23572148,"MASCOT Score",28.0000000,,,,,,0.0016000
TRVYVSLFHTLFRLYLSCER,ph,Y,70,true,"srk2dei ABA signaling phopshoproteomics",83,23572148,"MASCOT Score",28.0000000,,,,,,0.0016000
