Peptide,PTM,ModifiedAA,ModifiedPosition,PeptideUniqueToGene,ExperimentDesc,ExpID,PubmedID,ScoreType,IdentScore,LocProb,Log2FChange,PQ-val,QuantSig,PEP,MassErrorPPM
MESGSEKKFPLNAK,nta,M,1,true,"Arabidopsis translation initiation landscape - NTA",167a,35069635,,,,,,,,
SRNTFVGTPCWMAPEVMQQLHGYDFK,ph,S,173,true,"Large-scale phosphorylation discovery",44,23111157,XCorr,4.2270000,,,,,,
NTFVGTPCWMAPEVMQQLHGYDFK,ph,T,176,true,"Tissue atlas Arabidopsis - ProteomicsDB",114,32188942,"MaxQuant score",113.9200000,0.9999800,,,,8.1624098457189E-28,
SRNTFVGTPCWMAPEVMQQLHGYDFK,ph,T,180,true,"TOR Kinase and ABA Receptor",100,29290610,XCorr,4.3328271,0.9962000,,,,0.0015790000325069,
SEYEAHLSQQEYIR,ph,S,324,true,"atm and atr DNA damage response",88,25561503,"MASCOT Score",32.0000000,1.0000000,,,,,-0.1000000
GISAWNFNLEDLK,ph,S,333,true,"STN8 phosphoproteome",38,21768351,"MASCOT Score",93.5100000,,,,,,-0.9279790
GISAWNFNLEDLK,ph,S,333,true,"Phosphoproteome ethylene-regulated time response",46,24043427,"MASCOT Score",40.8400000,,,,,,13.4499000
GISAWNFNLEDLK,ph,S,333,true,"srk2dei ABA signaling phopshoproteomics",83,23572148,"MASCOT Score",29.0000000,,,,,,0.0004000
GISAWNFNLEDLK,ph,S,333,true,"SnRK2 protein kinase substrates",85,23776212,XCorr,2.9161351,1.0000000,,,,0.0010299499845132,
GISAWNFNLEDLK,ph,S,333,true,"TOR Kinase and ABA Receptor",100,29290610,XCorr,5.0429630,1.0000000,,,,2.2929999943244E-7,
GISAWNFNLEDLK,ph,S,333,true,"Phospho cell culture sucrose/TOR",109,30833711,,,1.0000000,,,,,
GISAWNFNLEDLK,ph,S,333,true,"Tissue atlas Arabidopsis - ProteomicsDB",114,32188942,"MaxQuant score",118.0800000,1.0000000,,,,6.9931098551024E-5,
GISAWNFNLEDLK,ph,S,333,true,"Touch-induced phosphorylation: 40s touch vs untouc",136,30291188,"MASCOT score",87.7200000,,-0.1582033,0.0347589,NO,,-3.0105403
TQAALISDDDTSHAEEPDFNQK,ph,S,350,true,"STN8 phosphoproteome",38,21768351,"MASCOT Score",46.0900000,,,,,,-0.9414680
TQAALISDDDTSHAEEPDFNQK,ph,S,350,true,"srk2dei ABA signaling phopshoproteomics",83,23572148,"MASCOT Score",84.0000000,,,,,,0.0008000
TQAALISDDDTSHAEEPDFNQK,ph,S,350,true,"LAXIC - ABA stress",84a,23660473,XCorr,4.1900000,0.9700000,,,,0.0052726701833308,
TQAALISDDDTSHAEEPDFNQK,ph,S,350,true,"LAXIC - mannitol vs control",84b,23660473,XCorr,4.0400000,0.9680000,,,,0.00040753599023446,
TQAALISDDDTSHAEEPDFNQK,ph,S,350,true,"SnRK2 protein kinase substrates",85,23776212,XCorr,4.4292040,1.0000000,,,,5.1146500481991E-5,
TQAALISDDDTSHAEEPDFNQK,ph,S,350,true,"TOR Kinase and ABA Receptor",100,29290610,XCorr,4.0589976,0.7955000,,,,8.5369998714668E-7,
TQAALISDDDTSHAEEPDFNQK,ph,S,350,true,"Lateral root-induction - NAA vs control",106,23328941,"MASCOT Score",55.0000000,,,,,,
TQAALISDDDTSHAEEPDFNQK,ph,S,350,true,"Phospho cell culture sucrose/TOR",109,30833711,,,0.9933470,,,,,
TQAALISDDDTSHAEEPDFNQK,ph,S,350,true,"Tissue atlas Arabidopsis - ProteomicsDB",114,32188942,"MaxQuant score",406.4500000,1.0000000,,,,0,
TQAALISDDDTSHAEEPDFNQK,ph,S,355,true,"Tissue atlas Arabidopsis - ProteomicsDB",114,32188942,"MaxQuant score",143.3200000,0.8936370,,,,6.6002802916962E-33,
QCERQDESALSPER,ph,S,376,true,"TOR Kinase and ABA Receptor",100,29290610,XCorr,3.2516079,0.9969000,,,,8.2699996710289E-5,
QDESALSPER,ph,S,376,true,"STN8 phosphoproteome",38,21768351,"MASCOT Score",50.8200000,,,,,,-0.2930990
QDESALSPER,ph,S,376,true,"Tyrosine phosphorylation in Arabidopsis",59,18463617,"MASCOT Score",35.0000000,,,,,,-0.7435031
QDESALSPER,ph,S,376,true,"Chloroplast kinase substrates",60,19376835,"MASCOT Score",53.3300000,,,,,,-0.1116550
QDESALSPER,ph,S,376,true,"LAXIC - ABA stress",84a,23660473,XCorr,2.6200000,0.9920000,,,,0.17200300097466,
QDESALSPER,ph,S,376,true,"LAXIC - mannitol vs control",84b,23660473,XCorr,3.1300000,1.0000000,,,,5.5999998949119E-6,
QDESALSPER,ph,S,376,true,"SnRK2 protein kinase substrates",85,23776212,XCorr,3.3680677,1.0000000,,,,0.011356400325894,
QDESALSPER,ph,S,376,true,"atm and atr DNA damage response",88,25561503,"MASCOT Score",46.0000000,1.0000000,,,,,-0.2600000
QDESALSPER,ph,S,376,true,"Lateral root-induction - NAA vs control",106,23328941,"MASCOT Score",27.0000000,,0.1990155,0.4607593,NO,,
QDESALSPER,ph,S,376,true,"Phospho cell culture sucrose/TOR",109,30833711,,,0.9999110,,,,,
QDESALSPER,ph,S,376,true,"Col-0 callus - FC Col-0 vs. Col-0 Xray",111a,31410901,,60.4300000,,1.4487166,0.0000000,NO,,0.3782285
QDESALSPER,ph,S,376,true,"Col-0 X-ray callus - FC Col-0 vs. Col-0 Xray",111b,31410901,,60.4300000,,1.4487166,0.0000000,NO,,0.3782285
QDESALSPER,ph,S,376,true,"atm callus - FC atm vs. atm Xray",111c,31410901,,60.4300000,,-0.2867614,0.0000000,NO,,0.3782285
QDESALSPER,ph,S,376,true,"atm-3 X-ray callus - FC atm vs. atm Xray",111d,31410901,,60.4300000,,-0.2867614,0.0000000,NO,,0.3782285
QDESALSPER,ph,S,376,true,"Tissue atlas Arabidopsis - ProteomicsDB",114,32188942,"MaxQuant score",229.5600000,0.9999960,,,,2.3921699263895E-36,
GCFDISEDEDNATTPDWK,ph,S,421,true,"Tyrosine phosphorylation in Arabidopsis",59,18463617,"MASCOT Score",78.0000000,,,,,,-2.1112498
GCFDISEDEDNATTPDWK,ph,S,421,true,"srk2dei ABA signaling phopshoproteomics",83,23572148,"MASCOT Score",87.0000000,,,,,,-0.0004000
GCFDISEDEDNATTPDWK,ph,S,421,true,"SnRK2 protein kinase substrates",85,23776212,XCorr,3.2397318,1.0000000,,,,2.1094599844673E-7,
GCFDISEDEDNATTPDWK,ph,S,421,true,"Lateral root-induction - NAA vs control",106,23328941,"MASCOT Score",33.0000000,,,,,,
GCFDISEDEDNATTPDWK,ph,S,421,true,"Phospho cell culture sucrose/TOR",109,30833711,,,0.9999980,,,,,
GCFDISEDEDNATTPDWK,ph,S,421,true,"Col-0 callus - FC Col-0 vs. Col-0 Xray",111a,31410901,,93.3300000,,1.7520437,0.0171333,YES,,1.8189961
GCFDISEDEDNATTPDWK,ph,S,421,true,"Col-0 X-ray callus - FC Col-0 vs. Col-0 Xray",111b,31410901,,93.3300000,,1.7520437,0.0171333,YES,,1.8189961
GCFDISEDEDNATTPDWK,ph,S,421,true,"atm callus - FC atm vs. atm Xray",111c,31410901,,93.3300000,,0.9776788,0.1909781,NO,,1.8189961
GCFDISEDEDNATTPDWK,ph,S,421,true,"atm-3 X-ray callus - FC atm vs. atm Xray",111d,31410901,,93.3300000,,0.9776788,0.1909781,NO,,1.8189961
GCFDISEDEDNATTPDWK,ph,S,421,true,"Tissue atlas Arabidopsis - ProteomicsDB",114,32188942,"MaxQuant score",302.1400000,1.0000000,,,,0,
GCFDISEDEDNATTPDWK,ph,T,428,true,"srk2dei ABA signaling phopshoproteomics",83,23572148,"MASCOT Score",26.0000000,,,,,,-0.0017000
GCFDISEDEDNATTPDWK,ph,T,428,true,"Lateral root-induction - NAA vs control",106,23328941,"MASCOT Score",40.0000000,,,,,,
GCFDISEDEDNATTPDWKDANVNSGQQLLTK,ph,T,429,true,"SnRK2 protein kinase substrates",85,23776212,XCorr,4.4957914,0.7540000,,,,9.8623296196365E-9,
GCFDISEDEDNATTPDWK,ph,T,429,true,"Large-scale phosphorylation discovery",44,23111157,XCorr,4.2640000,,,,,,
GCFDISEDEDNATTPDWK,ph,T,429,true,"srk2dei ABA signaling phopshoproteomics",83,23572148,"MASCOT Score",99.0000000,,,,,,0.0000000
GCFDISEDEDNATTPDWK,ph,T,429,true,"SnRK2 protein kinase substrates",85,23776212,XCorr,4.2116523,0.9980000,,,,4.3338100577835E-13,
GCFDISEDEDNATTPDWK,ph,T,429,true,"Lateral root-induction - NAA vs control",106,23328941,"MASCOT Score",40.0000000,,,,,,
GCFDISEDEDNATTPDWK,ph,T,429,true,"Tissue atlas Arabidopsis - ProteomicsDB",114,32188942,"MaxQuant score",315.2100000,0.9947380,,,,0,
DANVNSGQQLLTK,ph,S,439,true,"Tissue atlas Arabidopsis - ProteomicsDB",114,32188942,"MaxQuant score",187.0100000,1.0000000,,,,2.5817299494125E-22,
ASIGSLAETTKEEDTAAQNTSLPR,ph,S,448,true,"Phospho cell culture sucrose/TOR",109,30833711,,,0.9811560,,,,,
ASIGSLAETTKEEDTAAQNTSLPR,ph,S,448,true,"Tissue atlas Arabidopsis - ProteomicsDB",114,32188942,"MaxQuant score",269.1900000,0.9999730,,,,0,
ASIGSLAETTK,ph,S,448,true,"Large-scale phosphorylation discovery",44,23111157,XCorr,3.1140000,,,,,,
ASIGSLAETTK,ph,S,448,true,"srk2dei ABA signaling phopshoproteomics",83,23572148,"MASCOT Score",41.0000000,,,,,,0.0003000
ASIGSLAETTK,ph,S,451,true,"srk2dei ABA signaling phopshoproteomics",83,23572148,"MASCOT Score",28.0000000,,,,,,-0.0006000
EEDTAAQNTSLPR,ph,S,467,true,"Large-scale phosphorylation discovery",44,23111157,XCorr,3.3400000,,,,,,
YLSGSIIPESTFSPK,ph,Y,479,true,"LAXIC - ABA stress",84a,23660473,XCorr,2.9900000,0.8290000,,,,0.0015068500069901,
YLSGSIIPESTFSPK,ph,Y,479,true,"TOR Kinase and ABA Receptor",100,29290610,XCorr,4.9253917,0.9254000,,,,3.232999915781E-6,
YLSGSIIPESTFSPK,ph,S,481,true,"Tissue atlas Arabidopsis - ProteomicsDB",114,32188942,"MaxQuant score",183.0000000,0.9999370,,,,3.5891499788513E-25,
YLSGSIIPESTFSPK,ph,S,488,true,"MAPK Arabidopsis substrates",45,23172892,"MaxQuant Score",137.4600000,,,,,,
YLSGSIIPESTFSPK,ph,S,488,true,"Tissue atlas Arabidopsis - ProteomicsDB",114,32188942,"MaxQuant score",225.3100000,0.8168610,,,,0,
YLSGSIIPESTFSPK,ph,T,489,true,"MAPK Arabidopsis substrates",45,23172892,"MaxQuant Score",94.4870000,,,,,,
KYLSGSIIPESTFSPK,ph,S,491,true,"Tissue atlas Arabidopsis - ProteomicsDB",114,32188942,"MaxQuant score",203.2300000,0.9940600,,,,0,
YLSGSIIPESTFSPK,ph,S,491,true,"Large-scale phosphorylation discovery",44,23111157,XCorr,3.3860000,,,,,,
YLSGSIIPESTFSPK,ph,S,491,true,"SnRK2 protein kinase substrates",85,23776212,XCorr,3.3564680,0.9140000,,,,0.0056781098246574,
SYSGSLYR,ph,S,513,true,"atm and atr DNA damage response",88,25561503,"MASCOT Score",48.0000000,0.9960000,,,,,0.0400000
SYSGSLYR,ph,S,513,true,"Tissue atlas Arabidopsis - ProteomicsDB",114,32188942,"MaxQuant score",98.7300000,0.9775710,,,,0.0053357100114226,
SYSGSLYR,ph,S,515,true,"Arabidopsis root NAA phosphoproteome",18a,27643528,"MaxQuant Score",56.5480000,0.9320000,,,,0.0010000000474975,-0.4900000
SYSGSLYR,ph,S,515,true,"STN8 phosphoproteome",38,21768351,"MASCOT Score",60.4700000,,,,,,0.3509080
SYSGSLYR,ph,S,515,true,"Tyrosine phosphorylation in Arabidopsis",59,18463617,"MASCOT Score",22.0000000,,,,,,-1.0875959
SYSGSLYR,ph,S,515,true,"Chloroplast kinase substrates",60,19376835,"MASCOT Score",54.4200000,,,,,,0.7061410
SYSGSLYR,ph,S,515,true,"Conserved plant phosphoproteome - Arabidopsis",61a,20466843,"MASCOT Score",45.0000000,1.0000000,,,,,
SYSGSLYR,ph,S,515,true,"srk2dei ABA signaling phopshoproteomics",83,23572148,"MASCOT Score",55.0000000,,,,,,-0.0002000
SYSGSLYR,ph,S,515,true,"SnRK2 protein kinase substrates",85,23776212,XCorr,2.5527120,0.9650000,,,,0.0026150199119002,
SYSGSLYR,ph,S,515,true,"atm and atr DNA damage response",88,25561503,"MASCOT Score",49.0000000,0.9290000,,,,,0.2500000
SYSGSLYR,ph,S,515,true,"TOR Kinase and ABA Receptor",100,29290610,XCorr,2.9432101,0.9447000,,,,0.0018009999766946,
SYSGSLYR,ph,S,515,true,"Lateral root-induction - NAA vs control",106,23328941,"MASCOT Score",23.0000000,,,,,,
SYSGSLYR,ph,S,515,true,"Phospho cell culture sucrose/TOR",109,30833711,,,0.9984190,,,,,
SYSGSLYR,ph,S,515,true,"Col-0 callus - FC Col-0 vs. Col-0 Xray",111a,31410901,,41.0600000,,0.7758577,0.0000000,NO,,0.0769611
SYSGSLYR,ph,S,515,true,"Col-0 X-ray callus - FC Col-0 vs. Col-0 Xray",111b,31410901,,41.0600000,,0.7758577,0.0000000,NO,,0.0769611
SYSGSLYR,ph,S,515,true,"atm callus - FC atm vs. atm Xray",111c,31410901,,41.0600000,,-0.5318222,0.0000000,NO,,0.0769611
SYSGSLYR,ph,S,515,true,"atm-3 X-ray callus - FC atm vs. atm Xray",111d,31410901,,41.0600000,,-0.5318222,0.0000000,NO,,0.0769611
SYSGSLYR,ph,S,515,true,"Tissue atlas Arabidopsis - ProteomicsDB",114,32188942,"MaxQuant score",203.1900000,1.0000000,,,,5.9083102722356E-14,
SYSGSLYR,ph,S,515,true,"Touch-induced phosphorylation: 40s touch vs untouc",136,30291188,"MASCOT score",49.4900000,,1.6494969,0.0347589,YES,,7.6367599
SYSGSLYR,ph,S,517,true,"LAXIC - mannitol vs control",84b,23660473,XCorr,2.3500000,0.8970000,,,,0.00085167697397992,
SYSGSLYR,ph,S,517,true,"atm and atr DNA damage response",88,25561503,"MASCOT Score",24.0000000,0.8170000,,,,,0.8900000
RDSVDETSEVPHVEHK,ph,S,525,true,"TOR Kinase and ABA Receptor",100,29290610,XCorr,3.7295423,0.9953000,,,,0.0041729998774827,
RDSVDETSEVPHVEHK,ph,S,525,true,"Phospho cell culture sucrose/TOR",109,30833711,,,0.9224120,,,,,
RDSVDETSEVPHVEHK,ph,S,525,true,"Tissue atlas Arabidopsis - ProteomicsDB",114,32188942,"MaxQuant score",185.3400000,0.9888920,,,,3.3128998758691E-36,
FKVTSADLSPK,ph,S,545,true,"Chloroplast kinase substrates",60,19376835,"MASCOT Score",32.7800000,,,,,,-0.0921636
FKVTSADLSPK,ph,S,545,true,"atm and atr DNA damage response",88,25561503,"MASCOT Score",23.0000000,0.9930000,,,,,-1.2100000
FKVTSADLSPK,ph,S,545,true,"Tissue atlas Arabidopsis - ProteomicsDB",114,32188942,"MaxQuant score",103.7600000,0.9596890,,,,0.00010923999798251,
VTSADLSPK,ph,S,545,true,"Conserved plant phosphoproteome - Arabidopsis",61a,20466843,"MASCOT Score",38.0000000,1.0000000,,,,,
FKVTSADLSPK,ph,S,549,true,"Phosphorylation nuclei-enriched fractions",28,19245862,,,,,,,,
FKVTSADLSPK,ph,S,549,true,"STN8 phosphoproteome",38,21768351,"MASCOT Score",69.5400000,,,,,,-0.8145080
FKVTSADLSPK,ph,S,549,true,"MAPK Arabidopsis substrates",45,23172892,"MaxQuant Score",94.1220000,,,,,,
FKVTSADLSPK,ph,S,549,true,"Phosphoproteome ethylene-regulated time response",46,24043427,"MASCOT Score",73.7100000,,,,,,-28.8923000
FKVTSADLSPK,ph,S,549,true,"PAMP-triggered phosphorylation",48,24601666,"MASCOT Score",30.3400000,,,,,,
FKVTSADLSPK,ph,S,549,true,"Chloroplast kinase substrates",60,19376835,"MASCOT Score",71.3800000,,,,,,-0.5004450
FKVTSADLSPK,ph,S,549,true,"LAXIC - ABA stress",84a,23660473,XCorr,3.2900000,0.9980000,,,,0.094337202608585,
FKVTSADLSPK,ph,S,549,true,"SnRK2 protein kinase substrates",85,23776212,XCorr,3.5553632,1.0000000,,,,0.00083247100701556,
FKVTSADLSPK,ph,S,549,true,"atm and atr DNA damage response",88,25561503,"MASCOT Score",38.0000000,1.0000000,,,,,-1.9700000
FKVTSADLSPK,ph,S,549,true,"Protein sumoylation and phosphorylation cross-talk",97,28419593,,,,,,,,
FKVTSADLSPK,ph,S,549,true,"Phosphorylation tonoplast membrane fraction",107,18686298,"MASCOT Score",38.0000000,,,,,,
FKVTSADLSPK,ph,S,549,true,"Col-0 callus - FC Col-0 vs. Col-0 Xray",111a,31410901,,48.8200000,,0.0663394,0.0000000,NO,,0.3418622
FKVTSADLSPK,ph,S,549,true,"Col-0 X-ray callus - FC Col-0 vs. Col-0 Xray",111b,31410901,,48.8200000,,0.0663394,0.0000000,NO,,0.3418622
FKVTSADLSPK,ph,S,549,true,"atm callus - FC atm vs. atm Xray",111c,31410901,,48.8200000,,-0.1593584,0.0000000,NO,,0.3418622
FKVTSADLSPK,ph,S,549,true,"atm-3 X-ray callus - FC atm vs. atm Xray",111d,31410901,,48.8200000,,-0.1593584,0.0000000,NO,,0.3418622
FKVTSADLSPK,ph,S,549,true,"Touch-induced phosphorylation: 40s touch vs untouc",136,30291188,"MASCOT score",65.6200000,,0.1945022,0.5795652,NO,,6.8661369
VTSADLSPK,ph,S,549,true,"STN8 phosphoproteome",38,21768351,"MASCOT Score",62.5300000,,,,,,0.2860560
VTSADLSPK,ph,S,549,true,"Large-scale phosphorylation discovery",44,23111157,XCorr,2.6470000,,,,,,
VTSADLSPK,ph,S,549,true,"Tyrosine phosphorylation in Arabidopsis",59,18463617,"MASCOT Score",38.0000000,,,,,,-0.5017801
VTSADLSPK,ph,S,549,true,"Chloroplast kinase substrates",60,19376835,"MASCOT Score",56.1900000,,,,,,0.9871300
VTSADLSPK,ph,S,549,true,"Conserved plant phosphoproteome - Arabidopsis",61a,20466843,"MASCOT Score",38.0000000,1.0000000,,,,,
VTSADLSPK,ph,S,549,true,"srk2dei ABA signaling phopshoproteomics",83,23572148,"MASCOT Score",37.0000000,,,,,,0.0000000
VTSADLSPK,ph,S,549,true,"atm and atr DNA damage response",88,25561503,"MASCOT Score",60.0000000,1.0000000,,,,,0.3000000
VTSADLSPK,ph,S,549,true,"TOR Kinase and ABA Receptor",100,29290610,XCorr,2.6368797,0.9975000,,,,0.01463000010699,
VTSADLSPK,ph,S,549,true,"Lateral root-induction - NAA vs control",106,23328941,"MASCOT Score",25.0000000,,,,,,
VTSADLSPK,ph,S,549,true,"Phospho cell culture sucrose/TOR",109,30833711,,,0.9999890,,,,,
VTSADLSPK,ph,S,549,true,"Col-0 callus - FC Col-0 vs. Col-0 Xray",111a,31410901,,34.0300000,,-0.3596222,0.0000000,NO,,-0.2376501
VTSADLSPK,ph,S,549,true,"Col-0 X-ray callus - FC Col-0 vs. Col-0 Xray",111b,31410901,,34.0300000,,-0.3596222,0.0000000,NO,,-0.2376501
VTSADLSPK,ph,S,549,true,"atm callus - FC atm vs. atm Xray",111c,31410901,,34.0300000,,-1.2275375,0.0000000,NO,,-0.2376501
VTSADLSPK,ph,S,549,true,"atm-3 X-ray callus - FC atm vs. atm Xray",111d,31410901,,34.0300000,,-1.2275375,0.0000000,NO,,-0.2376501
VTSADLSPK,ph,S,549,true,"Tissue atlas Arabidopsis - ProteomicsDB",114,32188942,"MaxQuant score",235.1100000,1.0000000,,,,2.1495918442743E-42,
YLEQTSAKQPGSPETNVDDLLQTPPATSR,ph,S,613,true,"MAPK Arabidopsis substrates",45,23172892,"MaxQuant Score",81.6500000,,,,,,
QPGSPETNVDDLLQTPPATSR,ph,S,613,true,"Large-scale phosphorylation discovery",44,23111157,XCorr,3.7300000,,,,,,
QPGSPETNVDDLLQTPPATSR,ph,S,613,true,"srk2dei ABA signaling phopshoproteomics",83,23572148,"MASCOT Score",61.0000000,,,,,,0.0026000
QPGSPETNVDDLLQTPPATSR,ph,S,613,true,"SnRK2 protein kinase substrates",85,23776212,XCorr,3.1358144,0.9810000,,,,0.0067774401977658,
QPGSPETNVDDLLQTPPATSR,ph,S,613,true,"Tissue atlas Arabidopsis - ProteomicsDB",114,32188942,"MaxQuant score",211.1700000,0.9999730,,,,0,
QPGSPETNVDDLLQTPPATSR,ph,S,613,true,"Touch-induced phosphorylation: 40s touch vs untouc",136,30291188,"MASCOT score",104.1500000,,0.0388935,0.9578044,NO,,2.2426640
QPGSPETNVDDLLQTPPATSR,ph,T,616,true,"srk2dei ABA signaling phopshoproteomics",83,23572148,"MASCOT Score",43.0000000,,,,,,0.0009000
QPGSPETNVDDLLQTPPATSR,ph,T,616,true,"atm and atr DNA damage response",88,25561503,"MASCOT Score",39.0000000,0.9200000,,,,,-0.8000000
QPGSPETNVDDLLQTPPATSR,ph,T,616,true,"TOR Kinase and ABA Receptor",100,29290610,XCorr,4.3501129,0.8866000,,,,0.0041899997740984,
