Peptide,PTM,ModifiedAA,ModifiedPosition,PeptideUniqueToGene,ExperimentDesc,ExpID,PubmedID,ScoreType,IdentScore,LocProb,Log2FChange,PQ-val,QuantSig,PEP,MassErrorPPM
AATASAIRYA,nt,A,2,true,"N-term acetylation drought responses",5,26184543,,,,,,,,
AATASAIRYA,nta,A,2,true,"N-term acetylation drought responses",5,26184543,,,,,,,,
TGPISSNDAASGLGNASSGGSSAR,ph,S,109,true,"Tissue atlas Arabidopsis - ProteomicsDB",114,32188942,"MaxQuant score",216.4500000,0.9970650,,,,0,
TGPISSNDAASGLGNASSGGSSAR,ph,S,120,true,"Tissue atlas Arabidopsis - ProteomicsDB",114,32188942,"MaxQuant score",212.8600000,0.9364400,,,,0,
TGPISSNDAASGLGNASSGGSSAR,ph,S,121,true,"Tissue atlas Arabidopsis - ProteomicsDB",114,32188942,"MaxQuant score",336.3500000,0.9101090,,,,0,
GPPSSAAGNELSPEAYCR,ph,S,139,true,"Tissue atlas Arabidopsis - ProteomicsDB",114,32188942,"MaxQuant score",410.7900000,1.0000000,,,,0,
GDSGGRGSWAPSR,me1,R,664,true,"Arabidopsis protein methylome",123,31809900,"MaxQuant Score",130.4700000,1.0000000,,,,2.1388500507661E-37,0.8053700
GGPPSTSSPPR,ph,T,696,true,"Lateral root-induction - NAA vs control",106,23328941,"MASCOT Score",37.0000000,,,,,,
GGPPSTSSPPR,ph,S,697,true,"Protein sumoylation and phosphorylation cross-talk",97,28419593,,,,,,,,
GGPPSTSSPPR,ph,S,697,true,"Lateral root-induction - NAA vs control",106,23328941,"MASCOT Score",28.0000000,,,,,,
GGPPSTSSPPR,ph,S,697,true,"Tissue atlas Arabidopsis - ProteomicsDB",114,32188942,"MaxQuant score",153.3400000,0.8266190,,,,3.7534899632874E-9,
GGPPSTSSPPR,ph,S,698,true,"SnRK2 protein kinase substrates",85,23776212,XCorr,2.2069664,0.9460000,,,,0.027641199529171,
GGPPSTSSPPR,ph,S,698,true,"Tissue atlas Arabidopsis - ProteomicsDB",114,32188942,"MaxQuant score",204.3200000,0.9932940,,,,2.057029949365E-24,
